Girar Builder robot | 1 May 01:09 2011

[#43869] DONE srpm=bygfoot-2.2.1-alt2.src.rpm

http://git.altlinux.org/tasks/archive/done/_42/43869/task/log.1.1

2011-May-01 03:03:42 :: task #43869 for sisyphus started by oddity:
#100 build bygfoot-2.2.1-alt2.src.rpm
2011-May-01 03:03:43 :: cloned Sisyphus
2011-May-01 03:03:45 :: [x86_64] #100 bygfoot-2.2.1-alt2.src.rpm: build start
2011-May-01 03:03:45 :: [i586] #100 bygfoot-2.2.1-alt2.src.rpm: build start
2011-May-01 03:05:55 :: [x86_64] #100 bygfoot-2.2.1-alt2.src.rpm: build OK
2011-May-01 03:06:00 :: [i586] #100 bygfoot-2.2.1-alt2.src.rpm: build OK
2011-May-01 03:06:04 :: build check OK
2011-May-01 03:06:05 :: noarch check OK
2011-May-01 03:06:06 :: version check OK
2011-May-01 03:06:52 :: created test repo
2011-May-01 03:06:58 :: dependencies check OK
2011-May-01 03:07:41 :: ELF symbols check OK
2011-May-01 03:08:04 :: [x86_64] bygfoot: install check OK
2011-May-01 03:08:06 :: [i586] bygfoot: install check OK
2011-May-01 03:08:31 :: [x86_64] bygfoot-debuginfo: install check OK
2011-May-01 03:08:34 :: [i586] bygfoot-debuginfo: install check OK
2011-May-01 03:08:34 :: gears inheritance check OK
2011-May-01 03:08:34 :: srpm inheritance check OK
girar-check-perms: access to bygfoot ALLOWED for oddity: project leader
2011-May-01 03:08:35 :: acl check OK
2011-May-01 03:08:35 :: task #43869 for sisyphus TESTED
2011-May-01 03:08:35 :: task is ready for commit
2011-May-01 03:08:35 :: packages update OK
2011-May-01 03:08:36 :: repo update OK
2011-May-01 03:08:48 :: contents_index update OK
2011-May-01 03:08:52 :: updated /srpms/b/bygfoot.git branch `sisyphus'
2011-May-01 03:08:55 :: gears update OK
(Continue reading)

Girar Builder robot | 1 May 01:10 2011

[#43867] FAILED gambit.git=4.6.0-alt1

http://git.altlinux.org/tasks/43867/task/log.1.1

2011-May-01 02:47:18 :: task #43867 for sisyphus started by cronbuild:
#100 build 4.6.0-alt1 from /people/cronbuild/packages/gambit.git
2011-May-01 02:47:20 :: cloned Sisyphus
2011-May-01 02:47:21 :: [i586] #100 gambit.git 4.6.0-alt1: build start
2011-May-01 02:47:21 :: [x86_64] #100 gambit.git 4.6.0-alt1: build start
	echo "#define ___VERSION $version_num" >> gambit-not$version_num.h; \
	echo "#include \"gambit.h\"" >> gambit-not$version_num.h
make[1]: Leaving directory `/usr/src/RPM/BUILD/gambit-4.6.0/gambit-4.6.0/include'
making all in lib
make[1]: Entering directory `/usr/src/RPM/BUILD/gambit-4.6.0/gambit-4.6.0/lib'
LD_LIBRARY_PATH=../lib:../gsi:../gsc: ../gsc-comp
-:d-,~~bin=../bin,~~lib=../lib,~~include=../include -f -c -check _io.scm
make[1]: *** [_io.c] Segmentation fault
make[1]: Leaving directory `/usr/src/RPM/BUILD/gambit-4.6.0/gambit-4.6.0/lib'
make: *** [all-recursive] Error 1
make: Leaving directory `/usr/src/RPM/BUILD/gambit-4.6.0/gambit-4.6.0'
2011-May-01 03:01:08 :: [i586] gambit.git 4.6.0-alt1: remote: build failed
2011-May-01 03:01:08 :: [i586] #100 gambit.git 4.6.0-alt1: build FAILED
2011-May-01 03:10:31 :: [x86_64] #100 gambit.git 4.6.0-alt1: build OK
2011-May-01 03:01:09 :: [i586] build FAILED
2011-May-01 03:10:31 :: task #43867 for sisyphus FAILED
Girar Builder robot | 1 May 01:13 2011

[#43868] DONE python-module-objects.inv.git=1.2.7.20110430-alt1

http://git.altlinux.org/tasks/archive/done/_42/43868/task/log.1.1

2011-May-01 03:10:36 :: task #43868 for sisyphus started by cronbuild:
#100 build 1.2.7.20110430-alt1 from /people/cronbuild/packages/python-module-objects.inv.git
2011-May-01 03:10:37 :: cloned Sisyphus
2011-May-01 03:10:38 :: [i586] #100 python-module-objects.inv.git 1.2.7.20110430-alt1: build start
2011-May-01 03:10:38 :: [x86_64] #100 python-module-objects.inv.git 1.2.7.20110430-alt1: build start
2011-May-01 03:11:09 :: [x86_64] #100 python-module-objects.inv.git 1.2.7.20110430-alt1: build OK
2011-May-01 03:11:10 :: [i586] #100 python-module-objects.inv.git 1.2.7.20110430-alt1: build OK
2011-May-01 03:11:13 :: build check OK
2011-May-01 03:11:13 :: noarch check OK
2011-May-01 03:11:14 :: version check OK
2011-May-01 03:11:46 :: created test repo
2011-May-01 03:11:56 :: dependencies check OK
2011-May-01 03:12:14 :: [i586] python-module-objects.inv: install check OK
2011-May-01 03:12:14 :: [x86_64] python-module-objects.inv: install check OK
2011-May-01 03:12:15 :: gears inheritance check OK
2011-May-01 03:12:15 :: srpm inheritance check OK
girar-check-perms: access to python-module-objects.inv ALLOWED for cronbuild: project leader
welcomes random builders
2011-May-01 03:12:15 :: acl check OK
2011-May-01 03:12:15 :: task #43868 for sisyphus TESTED
2011-May-01 03:12:15 :: task is ready for commit
2011-May-01 03:12:15 :: packages update OK
2011-May-01 03:12:16 :: repo update OK
2011-May-01 03:12:34 :: contents_index update OK
2011-May-01 03:12:34 :: updated /gears/p/python-module-objects.inv.git branch `sisyphus'
2011-May-01 03:12:58 :: gears update OK
2011-May-01 03:13:04 :: task #43868 for sisyphus DONE
(Continue reading)

Girar Builder robot | 1 May 01:17 2011

[#43871] DONE srpm=etherape-0.9.10-alt2.src.rpm

http://git.altlinux.org/tasks/archive/done/_42/43871/task/log.1.1

2011-May-01 03:13:00 :: task #43871 for sisyphus started by oddity:
#100 build etherape-0.9.10-alt2.src.rpm
2011-May-01 03:13:00 :: waiting for a shared lock on Sisyphus
2011-May-01 03:13:04 :: acquired a shared lock on Sisyphus
2011-May-01 03:13:05 :: cloned Sisyphus
2011-May-01 03:13:06 :: [i586] #100 etherape-0.9.10-alt2.src.rpm: build start
2011-May-01 03:13:06 :: [x86_64] #100 etherape-0.9.10-alt2.src.rpm: build start
2011-May-01 03:14:25 :: [i586] #100 etherape-0.9.10-alt2.src.rpm: build OK
2011-May-01 03:14:27 :: [x86_64] #100 etherape-0.9.10-alt2.src.rpm: build OK
2011-May-01 03:14:31 :: build check OK
2011-May-01 03:14:32 :: noarch check OK
2011-May-01 03:14:33 :: version check OK
2011-May-01 03:15:18 :: created test repo
2011-May-01 03:15:25 :: dependencies check OK
2011-May-01 03:16:05 :: ELF symbols check OK
	i586: etherape=0.9.10-alt2 post-install unowned files:
/etc/etherape
/usr/share/etherape
/usr/share/etherape/glade
/usr/share/gnome
/usr/share/gnome/help
/usr/share/omf
	x86_64: etherape=0.9.10-alt2 post-install unowned files:
/etc/etherape
/usr/share/etherape
/usr/share/etherape/glade
/usr/share/gnome
/usr/share/gnome/help
(Continue reading)

Girar Builder robot | 1 May 01:21 2011

[#43875] DONE srpm=zsnes-1.51-alt5.src.rpm

http://git.altlinux.org/tasks/archive/done/_42/43875/task/log.1.1

2011-May-01 03:17:05 :: task #43875 for sisyphus started by oddity:
#100 build zsnes-1.51-alt5.src.rpm
2011-May-01 03:17:05 :: waiting for a shared lock on Sisyphus
2011-May-01 03:17:36 :: acquired a shared lock on Sisyphus
2011-May-01 03:17:39 :: cloned Sisyphus
2011-May-01 03:17:40 :: [i586] #100 zsnes-1.51-alt5.src.rpm: build start
2011-May-01 03:17:40 :: [x86_64] #100 zsnes-1.51-alt5.src.rpm: build start
2011-May-01 03:17:40 :: [x86_64] #100 zsnes-1.51-alt5.src.rpm: build SKIPPED
2011-May-01 03:19:19 :: [i586] #100 zsnes-1.51-alt5.src.rpm: build OK
2011-May-01 03:19:21 :: build check OK
2011-May-01 03:19:21 :: noarch check OK
2011-May-01 03:19:22 :: version check OK
2011-May-01 03:19:53 :: created test repo
2011-May-01 03:20:00 :: dependencies check OK
2011-May-01 03:20:38 :: ELF symbols check OK
2011-May-01 03:20:56 :: [i586] zsnes: install check OK
2011-May-01 03:20:57 :: gears inheritance check OK
2011-May-01 03:20:57 :: srpm inheritance check OK
girar-check-perms: access to zsnes ALLOWED for oddity: project leader
2011-May-01 03:20:57 :: acl check OK
2011-May-01 03:20:58 :: task #43875 for sisyphus TESTED
2011-May-01 03:20:58 :: task is ready for commit
2011-May-01 03:20:58 :: packages update OK
2011-May-01 03:20:58 :: repo update OK
2011-May-01 03:21:13 :: contents_index update OK
2011-May-01 03:21:15 :: updated /srpms/z/zsnes.git branch `sisyphus'
2011-May-01 03:21:18 :: gears update OK
2011-May-01 03:21:23 :: task #43875 for sisyphus DONE
(Continue reading)

Girar Builder robot | 1 May 01:24 2011

[#43870] DONE srpm=dgen-sdl-1.23-alt9.src.rpm

http://git.altlinux.org/tasks/archive/done/_42/43870/task/log.1.2

2011-May-01 03:20:59 :: task #43870 for sisyphus started by oddity:
#100 build dgen-sdl-1.23-alt9.src.rpm
2011-May-01 03:20:59 :: waiting for a shared lock on Sisyphus
2011-May-01 03:21:23 :: acquired a shared lock on Sisyphus
2011-May-01 03:21:24 :: cloned Sisyphus
2011-May-01 03:21:25 :: [i586] #100 dgen-sdl-1.23-alt9.src.rpm: build start
2011-May-01 03:21:25 :: [x86_64] #100 dgen-sdl-1.23-alt9.src.rpm: build start
2011-May-01 03:21:42 :: [i586] dgen-sdl-1.23-alt9.src.rpm: remote: no need to rebuild
2011-May-01 03:21:42 :: [i586] #100 dgen-sdl-1.23-alt9.src.rpm: build OK
2011-May-01 03:21:44 :: [x86_64] dgen-sdl-1.23-alt9.src.rpm: remote: no need to rebuild
2011-May-01 03:21:44 :: [x86_64] #100 dgen-sdl-1.23-alt9.src.rpm: build OK
2011-May-01 03:21:48 :: build check OK
2011-May-01 03:21:49 :: noarch check OK
2011-May-01 03:21:50 :: version check OK
2011-May-01 03:22:39 :: created test repo
2011-May-01 03:22:45 :: dependencies check OK
2011-May-01 03:23:33 :: ELF symbols check OK
2011-May-01 03:23:47 :: [i586] dgen-sdl: no need to repeat, install check SKIPPED
2011-May-01 03:23:47 :: [x86_64] dgen-sdl: no need to repeat, install check SKIPPED
2011-May-01 03:23:50 :: [i586] dgen-sdl-debuginfo: no need to repeat, install check SKIPPED
2011-May-01 03:23:50 :: [x86_64] dgen-sdl-debuginfo: no need to repeat, install check SKIPPED
2011-May-01 03:23:50 :: gears inheritance check OK
2011-May-01 03:23:50 :: srpm inheritance check OK
girar-check-perms: access to dgen-sdl ALLOWED for oddity: project leader
2011-May-01 03:23:50 :: acl check OK
2011-May-01 03:23:51 :: task #43870 for sisyphus TESTED
2011-May-01 03:23:51 :: task is ready for commit
2011-May-01 03:23:51 :: packages update OK
(Continue reading)

Girar Builder robot | 1 May 01:28 2011

[#43872] DONE srpm=fceultra-0.98.13-alt2.src.rpm

http://git.altlinux.org/tasks/archive/done/_42/43872/task/log.1.1

2011-May-01 03:23:52 :: task #43872 for sisyphus started by oddity:
#100 build fceultra-0.98.13-alt2.src.rpm
2011-May-01 03:23:52 :: waiting for a shared lock on Sisyphus
2011-May-01 03:24:26 :: acquired a shared lock on Sisyphus
2011-May-01 03:24:27 :: cloned Sisyphus
2011-May-01 03:24:28 :: [i586] #100 fceultra-0.98.13-alt2.src.rpm: build start
2011-May-01 03:24:28 :: [x86_64] #100 fceultra-0.98.13-alt2.src.rpm: build start
2011-May-01 03:24:29 :: [x86_64] #100 fceultra-0.98.13-alt2.src.rpm: build SKIPPED
2011-May-01 03:26:19 :: [i586] #100 fceultra-0.98.13-alt2.src.rpm: build OK
2011-May-01 03:26:22 :: build check OK
2011-May-01 03:26:22 :: noarch check OK
2011-May-01 03:26:23 :: version check OK
2011-May-01 03:26:54 :: created test repo
2011-May-01 03:27:01 :: dependencies check OK
2011-May-01 03:27:38 :: ELF symbols check OK
2011-May-01 03:27:56 :: [i586] fceultra: install check OK
2011-May-01 03:28:14 :: [i586] fceultra-debuginfo: install check OK
2011-May-01 03:28:15 :: gears inheritance check OK
2011-May-01 03:28:15 :: srpm inheritance check OK
girar-check-perms: access to fceultra ALLOWED for oddity: project leader
2011-May-01 03:28:15 :: acl check OK
2011-May-01 03:28:15 :: task #43872 for sisyphus TESTED
2011-May-01 03:28:15 :: task is ready for commit
2011-May-01 03:28:16 :: packages update OK
2011-May-01 03:28:16 :: repo update OK
2011-May-01 03:28:30 :: contents_index update OK
2011-May-01 03:28:32 :: updated /srpms/f/fceultra.git branch `sisyphus'
2011-May-01 03:28:40 :: gears update OK
(Continue reading)

Girar Builder robot | 1 May 01:33 2011

[#43873] DONE srpm=libgtkglarea2-1.99.0-alt4.3.src.rpm

http://git.altlinux.org/tasks/archive/done/_42/43873/task/log.1.1

2011-May-01 03:28:16 :: task #43873 for sisyphus started by oddity:
#100 build libgtkglarea2-1.99.0-alt4.3.src.rpm
2011-May-01 03:28:16 :: waiting for a shared lock on Sisyphus
2011-May-01 03:28:45 :: acquired a shared lock on Sisyphus
2011-May-01 03:28:46 :: cloned Sisyphus
2011-May-01 03:28:47 :: [x86_64] #100 libgtkglarea2-1.99.0-alt4.3.src.rpm: build start
2011-May-01 03:28:47 :: [i586] #100 libgtkglarea2-1.99.0-alt4.3.src.rpm: build start
2011-May-01 03:29:46 :: [i586] #100 libgtkglarea2-1.99.0-alt4.3.src.rpm: build OK
2011-May-01 03:29:48 :: [x86_64] #100 libgtkglarea2-1.99.0-alt4.3.src.rpm: build OK
2011-May-01 03:29:52 :: build check OK
2011-May-01 03:29:53 :: noarch check OK
2011-May-01 03:29:54 :: version check OK
2011-May-01 03:30:40 :: created test repo
2011-May-01 03:30:46 :: dependencies check OK
2011-May-01 03:31:26 :: ELF symbols check OK
2011-May-01 03:31:49 :: [i586] libgtkglarea2: install check OK
2011-May-01 03:31:50 :: [x86_64] libgtkglarea2: install check OK
2011-May-01 03:32:15 :: [i586] libgtkglarea2-debuginfo: install check OK
2011-May-01 03:32:16 :: [x86_64] libgtkglarea2-debuginfo: install check OK
	i586: libgtkglarea2-devel=1.99.0-alt4.3 post-install unowned files:
/usr/include/gtkgl-2.0
2011-May-01 03:32:39 :: [i586] libgtkglarea2-devel: install check OK
	x86_64: libgtkglarea2-devel=1.99.0-alt4.3 post-install unowned files:
/usr/include/gtkgl-2.0
2011-May-01 03:32:39 :: [x86_64] libgtkglarea2-devel: install check OK
2011-May-01 03:32:40 :: gears inheritance check OK
2011-May-01 03:32:40 :: srpm inheritance check OK
girar-check-perms: access to libgtkglarea2 ALLOWED for oddity: project leader
(Continue reading)

Girar Builder robot | 1 May 01:38 2011

[#43874] DONE srpm=prboom-2.5.0-alt0.3.src.rpm

http://git.altlinux.org/tasks/archive/done/_42/43874/task/log.1.1

2011-May-01 03:32:41 :: task #43874 for sisyphus started by oddity:
#100 build prboom-2.5.0-alt0.3.src.rpm
2011-May-01 03:32:42 :: waiting for a shared lock on Sisyphus
2011-May-01 03:33:23 :: acquired a shared lock on Sisyphus
2011-May-01 03:33:25 :: cloned Sisyphus
2011-May-01 03:33:26 :: [i586] #100 prboom-2.5.0-alt0.3.src.rpm: build start
2011-May-01 03:33:26 :: [x86_64] #100 prboom-2.5.0-alt0.3.src.rpm: build start
2011-May-01 03:34:56 :: [i586] #100 prboom-2.5.0-alt0.3.src.rpm: build OK
2011-May-01 03:34:58 :: [x86_64] #100 prboom-2.5.0-alt0.3.src.rpm: build OK
2011-May-01 03:35:02 :: build check OK
2011-May-01 03:35:03 :: noarch check OK
2011-May-01 03:35:04 :: version check OK
2011-May-01 03:35:53 :: created test repo
2011-May-01 03:35:59 :: dependencies check OK
2011-May-01 03:36:40 :: ELF symbols check OK
	x86_64: prboom=2.5.0-alt0.3 post-install unowned files:
/usr/share/games/doom
	i586: prboom=2.5.0-alt0.3 post-install unowned files:
/usr/share/games/doom
2011-May-01 03:36:59 :: [x86_64] prboom: install check OK
2011-May-01 03:36:59 :: [i586] prboom: install check OK
2011-May-01 03:37:18 :: [x86_64] prboom-debuginfo: install check OK
2011-May-01 03:37:19 :: [i586] prboom-debuginfo: install check OK
2011-May-01 03:37:19 :: gears inheritance check OK
2011-May-01 03:37:19 :: srpm inheritance check OK
girar-check-perms: access to prboom ALLOWED for oddity: project leader
2011-May-01 03:37:19 :: acl check OK
2011-May-01 03:37:19 :: task #43874 for sisyphus TESTED
(Continue reading)

Girar Builder robot | 1 May 01:44 2011

[#43876] FAILED srpm=fglrx_glx-8.84.1-alt1.src.rpm

http://git.altlinux.org/tasks/43876/task/log.1.1

2011-May-01 03:37:21 :: task #43876 for sisyphus started by oddity:
#100 build fglrx_glx-8.84.1-alt1.src.rpm
2011-May-01 03:37:21 :: waiting for a shared lock on Sisyphus
2011-May-01 03:38:13 :: acquired a shared lock on Sisyphus
2011-May-01 03:38:15 :: cloned Sisyphus
2011-May-01 03:38:16 :: [x86_64] #100 fglrx_glx-8.84.1-alt1.src.rpm: build start
2011-May-01 03:38:16 :: [i586] #100 fglrx_glx-8.84.1-alt1.src.rpm: build start
2011-May-01 03:41:39 :: [x86_64] #100 fglrx_glx-8.84.1-alt1.src.rpm: build OK
2011-May-01 03:42:10 :: [i586] #100 fglrx_glx-8.84.1-alt1.src.rpm: build OK
2011-May-01 03:42:19 :: build check OK
--- fglrx-tools-8.84.1-alt1.i586.rpm.share	2011-05-01 03:42:20.587962961 +0400
+++ fglrx-tools-8.84.1-alt1.x86_64.rpm.share	2011-05-01 03:42:20.751959993 +0400
 <at>  <at>  -1,25 +1  <at>  <at> 
-/usr/share/applications/ati-controlcenter.desktop	100644	ASCII text
-/usr/share/ati/amdcccle	40755	directory
-/usr/share/ati/amdcccle/amdcccle_cs.qm	100644	data
-/usr/share/ati/amdcccle/amdcccle_da_DK.qm	100644	data
-/usr/share/ati/amdcccle/amdcccle_de.qm	100644	data
-/usr/share/ati/amdcccle/amdcccle_el_GR.qm	100644	data
-/usr/share/ati/amdcccle/amdcccle_es_ES.qm	100644	data
-/usr/share/ati/amdcccle/amdcccle_fi_FI.qm	100644	data
-/usr/share/ati/amdcccle/amdcccle_fr_FR.qm	100644	data
-/usr/share/ati/amdcccle/amdcccle_hu_HU.qm	100644	data
-/usr/share/ati/amdcccle/amdcccle_it_IT.qm	100644	data
-/usr/share/ati/amdcccle/amdcccle_ja.qm	100644	data
-/usr/share/ati/amdcccle/amdcccle_ko_KR.qm	100644	data
-/usr/share/ati/amdcccle/amdcccle_nl_NL.qm	100644	data
-/usr/share/ati/amdcccle/amdcccle_no.qm	100644	data
(Continue reading)


Gmane