[#146045] FAILED fontforge.git=20150612-alt0.3

http://git.altlinux.org/tasks/146045/logs/events.1.1.log

2015-Jul-03 07:22:12 :: task #146045 for sisyphus started by pv:
#100 build 20150612-alt0.3 from /people/pv/packages/fontforge.git
2015-Jul-03 07:22:13 :: [x86_64] #100 fontforge.git 20150612-alt0.3: build start
2015-Jul-03 07:22:13 :: [i586] #100 fontforge.git 20150612-alt0.3: build start
find-requires: running scripts (cpp,debuginfo,files,gir-js,gir-python,gir,lib,pam,perl,pkgconfig,pkgconfiglib,python,rpmlib,shebang,shell,static,symlinks,typelib)
/usr/src/tmp/fontforge-buildroot/usr/include/fontforge/ffpython.h:28:22: fatal error:
flaglist.h: No such file or directory
compilation terminated.
cpp.req: /usr/src/tmp/fontforge-buildroot/usr/include/fontforge/ffpython.h: cpp failed, trying
c++ mode
x86_64-alt-linux-cpp: error trying to exec 'cc1plus': execvp: No such file or directory
cpp.req: WARNING: /usr/src/tmp/fontforge-buildroot/usr/include/fontforge/ffpython.h: cpp failed
/usr/src/tmp/fontforge-buildroot/usr/include/fontforge/bezctx_ff.h:1:30: fatal error:
spiroentrypoints.h: No such file or directory
compilation terminated.
cpp.req: WARNING: /usr/src/tmp/fontforge-buildroot/usr/include/fontforge/bezctx_ff.h: cpp failed
/usr/src/tmp/fontforge-buildroot/usr/include/fontforge/fvmetrics.h:27:25: fatal error:
fontforgeui.h: No such file or directory
compilation terminated.
cpp.req: WARNING: /usr/src/tmp/fontforge-buildroot/usr/include/fontforge/fvmetrics.h: cpp failed
/usr/src/tmp/fontforge-buildroot/usr/include/fontforge/nonlineartrans.h:27:25: fatal error:
fontforgeui.h: No such file or directory
compilation terminated.
--
/.out/fontforge-20150612-alt0.3.x86_64.rpm: filesystem intersections:
/usr/share/icons/hicolor /usr/share/icons/hicolor/32x32 /usr/share/icons/hicolor/32x32/apps
sisyphus_check: check-intersects ERROR: intersections with system packages
hsh-rebuild: pkg.tar: sisyphus_check failed.
(Continue reading)

[#146044] FAILED fontforge.git=20150612-alt0.3

http://git.altlinux.org/tasks/146044/logs/events.1.1.log

2015-Jul-03 07:10:36 :: task #146044 for sisyphus started by pv:
#100 build 20150612-alt0.3 from /people/pv/packages/fontforge.git
2015-Jul-03 07:10:37 :: [i586] #100 fontforge.git 20150612-alt0.3: build start
2015-Jul-03 07:10:37 :: [x86_64] #100 fontforge.git 20150612-alt0.3: build start
Processing files: fontforge-20150612-alt0.3
error: File not found by glob: /usr/src/tmp/fontforge-buildroot/usr/share/mime/packages/*
Executing(%doc): /bin/sh -e /usr/src/tmp/rpm-tmp.2251
2015-Jul-03 07:19:15 :: [x86_64] fontforge.git 20150612-alt0.3: remote: build failed
2015-Jul-03 07:19:15 :: [x86_64] #100 fontforge.git 20150612-alt0.3: build FAILED
Processing files: fontforge-20150612-alt0.3
error: File not found by glob: /usr/src/tmp/fontforge-buildroot/usr/share/mime/packages/*
Executing(%doc): /bin/sh -e /usr/src/tmp/rpm-tmp.67069
2015-Jul-03 07:20:04 :: [i586] fontforge.git 20150612-alt0.3: remote: build failed
2015-Jul-03 07:20:04 :: [i586] #100 fontforge.git 20150612-alt0.3: build FAILED
2015-Jul-03 07:19:15 :: [x86_64] build FAILED
2015-Jul-03 07:20:04 :: [i586] build FAILED
2015-Jul-03 07:20:04 :: task #146044 for sisyphus FAILED

[#146043] FAILED fontforge.git=20150612-alt0.3

http://git.altlinux.org/tasks/146043/logs/events.1.1.log

2015-Jul-03 07:01:14 :: task #146043 for sisyphus started by pv:
#100 build 20150612-alt0.3 from /people/pv/packages/fontforge.git
2015-Jul-03 07:01:15 :: [i586] #100 fontforge.git 20150612-alt0.3: build start
2015-Jul-03 07:01:15 :: [x86_64] #100 fontforge.git 20150612-alt0.3: build start
+ ./bootstrap
bootstrap:   error: Prerequisite 'git' not found. Please install it, or
bootstrap:          'export GIT=/path/to/git'.
bootstrap:   error: Program    Min_version Homepage                            
bootstrap:          -----------------------------------------------------------
2015-Jul-03 07:02:20 :: [x86_64] fontforge.git 20150612-alt0.3: remote: build failed
2015-Jul-03 07:02:20 :: [x86_64] #100 fontforge.git 20150612-alt0.3: build FAILED
+ ./bootstrap
bootstrap:   error: Prerequisite 'git' not found. Please install it, or
bootstrap:          'export GIT=/path/to/git'.
bootstrap:   error: Program    Min_version Homepage                            
bootstrap:          -----------------------------------------------------------
2015-Jul-03 07:02:23 :: [i586] fontforge.git 20150612-alt0.3: remote: build failed
2015-Jul-03 07:02:23 :: [i586] #100 fontforge.git 20150612-alt0.3: build FAILED
2015-Jul-03 07:02:20 :: [x86_64] build FAILED
2015-Jul-03 07:02:23 :: [i586] build FAILED
2015-Jul-03 07:02:23 :: task #146043 for sisyphus FAILED

[#146042] FAILED fontforge.git=20150612-alt0.2

http://git.altlinux.org/tasks/146042/logs/events.1.1.log

2015-Jul-03 06:27:19 :: task #146042 for sisyphus started by pv:
#100 build 20150612-alt0.2 from /people/pv/packages/fontforge.git
2015-Jul-03 06:27:20 :: [x86_64] #100 fontforge.git 20150612-alt0.2: build start
2015-Jul-03 06:27:20 :: [i586] #100 fontforge.git 20150612-alt0.2: build start
if [ -e uthash ] ; then rm -r uthash ; fi ; \
git clone https://github.com/troydhanson/uthash ; \
fi ;
Cloning into 'uthash'...
fatal: unable to access 'https://github.com/troydhanson/uthash/': Could not resolve host: github.com
make: *** [uthash/src] Error 128
make: Leaving directory `/usr/src/RPM/BUILD/fontforge-20150612'
error: Bad exit status from /usr/src/tmp/rpm-tmp.103 (%build)
RPM build errors:
    Macro %U not found
2015-Jul-03 06:30:35 :: [x86_64] fontforge.git 20150612-alt0.2: remote: build failed
2015-Jul-03 06:30:35 :: [x86_64] #100 fontforge.git 20150612-alt0.2: build FAILED
if [ -e uthash ] ; then rm -r uthash ; fi ; \
git clone https://github.com/troydhanson/uthash ; \
fi ;
Cloning into 'uthash'...
fatal: unable to access 'https://github.com/troydhanson/uthash/': Could not resolve host: github.com
make: *** [uthash/src] Error 128
make: Leaving directory `/usr/src/RPM/BUILD/fontforge-20150612'
error: Bad exit status from /usr/src/tmp/rpm-tmp.15309 (%build)
RPM build errors:
    Macro %U not found
2015-Jul-03 06:30:44 :: [i586] fontforge.git 20150612-alt0.2: remote: build failed
2015-Jul-03 06:30:44 :: [i586] #100 fontforge.git 20150612-alt0.2: build FAILED
(Continue reading)

Girar Builder pender robot | 3 Jul 07:34 2015

[#146004] DONE (try 3) v8.git=4.3.61.30-alt4 srpm=chromium-43.0.2357.130-alt1.src.rpm

http://git.altlinux.org/tasks/archive/done/_142/146004/logs/events.3.2.log

2015-Jul-03 05:16:06 :: task #146004 for sisyphus resumed by cas:
#40 build 4.3.61.30-alt4 from /people/cas/packages/v8.git
#100 build chromium-43.0.2357.130-alt1.src.rpm
2015-Jul-03 05:16:25 :: created build repo
2015-Jul-03 05:16:26 :: [x86_64] #40 v8.git 4.3.61.30-alt4: build start
2015-Jul-03 05:16:27 :: [i586] #40 v8.git 4.3.61.30-alt4: build start
2015-Jul-03 05:17:10 :: [x86_64] v8.git 4.3.61.30-alt4: remote: no need to rebuild
2015-Jul-03 05:17:10 :: [x86_64] #40 v8.git 4.3.61.30-alt4: build OK
2015-Jul-03 05:17:10 :: [x86_64] #100 chromium-43.0.2357.130-alt1.src.rpm: build start
2015-Jul-03 05:17:10 :: [i586] v8.git 4.3.61.30-alt4: remote: no need to rebuild
2015-Jul-03 05:17:11 :: [i586] #40 v8.git 4.3.61.30-alt4: build OK
2015-Jul-03 05:17:11 :: [i586] #100 chromium-43.0.2357.130-alt1.src.rpm: build start
2015-Jul-03 05:18:04 :: [i586] chromium-43.0.2357.130-alt1.src.rpm: remote: no need to rebuild
2015-Jul-03 05:18:04 :: [i586] #100 chromium-43.0.2357.130-alt1.src.rpm: build OK
2015-Jul-03 05:18:04 :: [x86_64] chromium-43.0.2357.130-alt1.src.rpm: remote: no need to rebuild
2015-Jul-03 05:18:04 :: [x86_64] #100 chromium-43.0.2357.130-alt1.src.rpm: build OK
2015-Jul-03 05:18:53 :: build check OK
2015-Jul-03 05:19:04 :: noarch check OK
2015-Jul-03 05:19:05 :: plan: src +2 -2 =17956, i586 +7 -7 =34116, x86_64 +7 -7 =34046
2015-Jul-03 05:19:05 :: version check OK
2015-Jul-03 05:20:20 :: generated apt indices
2015-Jul-03 05:20:20 :: created next repo
2015-Jul-03 05:20:35 :: dependencies check OK
2015-Jul-03 05:21:02 :: ELF symbols check OK
	i586: chromium=43.0.2357.130-alt1 post-install unowned files:
/etc/chromium
2015-Jul-03 05:21:28 :: [i586] #100 chromium: no need to repeat, install check SKIPPED
	x86_64: chromium=43.0.2357.130-alt1 post-install unowned files:
(Continue reading)

Girar Builder pender robot | 3 Jul 07:15 2015

[#146035] DONE (try 2) appstream.git=0.8.2-alt1

http://git.altlinux.org/tasks/archive/done/_142/146035/logs/events.2.1.log

2015-Jul-03 05:09:25 :: task is ready for commit
2015-Jul-03 05:14:41 :: repo clone OK
2015-Jul-03 05:14:43 :: packages update OK
2015-Jul-03 05:14:53 :: [i586 x86_64] update OK
2015-Jul-03 05:14:54 :: [x86_64-i586] update OK
2015-Jul-03 05:14:54 :: repo update OK
2015-Jul-03 05:15:01 :: repo save OK
2015-Jul-03 05:15:10 :: updated /gears/a/appstream.git branch `sisyphus'
2015-Jul-03 05:15:15 :: gears update OK
2015-Jul-03 05:15:15 :: task #146035 for sisyphus DONE

[#146041] p7 TESTED copy=dropbox-uploader

http://git.altlinux.org/tasks/146041/logs/events.1.1.log

2015-Jul-03 04:50:05 :: test-only task #146041 for p7 started by cas:
#100 copy dropbox-uploader from sisyphus
2015-Jul-03 04:50:06 :: copy from `sisyphus': dropbox-uploader-0.15-alt1.src.rpm
2015-Jul-03 04:50:09 :: build check OK
2015-Jul-03 04:50:10 :: noarch check OK
2015-Jul-03 04:50:11 :: plan: src +1 -0 =14858, noarch +1 -0 =13366
2015-Jul-03 04:50:11 :: version check OK
2015-Jul-03 04:51:41 :: generated apt indices
2015-Jul-03 04:51:41 :: created next repo
2015-Jul-03 04:51:53 :: dependencies check OK
2015-Jul-03 04:52:14 :: [i586] #100 dropbox-uploader: install check OK
2015-Jul-03 04:52:14 :: [x86_64] #100 dropbox-uploader: install check OK
2015-Jul-03 04:52:15 :: gears inheritance check OK
2015-Jul-03 04:52:15 :: srpm inheritance check OK
girar-check-perms: access to dropbox-uploader ALLOWED for cas: superuser
2015-Jul-03 04:52:15 :: acl check OK
2015-Jul-03 04:52:33 :: created contents_index files
2015-Jul-03 04:52:38 :: created hash files: noarch src
2015-Jul-03 04:52:43 :: task #146041 for p7 TESTED
Girar Builder pender robot | 3 Jul 03:11 2015

[#146040] t7 DONE copy=moodle2.0-lang-eu

http://git.altlinux.org/tasks/archive/done/_142/146040/logs/events.1.1.log

2015-Jul-03 01:07:32 :: task #146040 for t7 started by cronport:
#100 copy moodle2.0-lang-eu from sisyphus
2015-Jul-03 01:07:33 :: copy from `sisyphus': moodle2.0-lang-eu-2.0.0.201507020857-alt1.src.rpm
2015-Jul-03 01:07:36 :: build check OK
2015-Jul-03 01:07:36 :: noarch check OK
2015-Jul-03 01:07:37 :: plan: src +1 -1 =15006, noarch +1 -1 =13603
2015-Jul-03 01:07:37 :: version check OK
2015-Jul-03 01:08:58 :: generated apt indices
2015-Jul-03 01:08:58 :: created next repo
2015-Jul-03 01:09:12 :: dependencies check OK
2015-Jul-03 01:10:07 :: [x86_64] #100 moodle2.0-lang-eu: install check OK
2015-Jul-03 01:10:12 :: [i586] #100 moodle2.0-lang-eu: install check OK
2015-Jul-03 01:10:14 :: gears inheritance check OK
2015-Jul-03 01:10:14 :: srpm inheritance check OK
girar-check-perms: access to moodle2.0-lang-eu ALLOWED for cronport: project leader welcomes random builders
2015-Jul-03 01:10:14 :: acl check OK
2015-Jul-03 01:10:33 :: created contents_index files
2015-Jul-03 01:10:38 :: created hash files: noarch src
2015-Jul-03 01:10:42 :: task #146040 for t7 TESTED
2015-Jul-03 01:10:42 :: task is ready for commit
2015-Jul-03 01:10:48 :: repo clone OK
2015-Jul-03 01:10:48 :: packages update OK
2015-Jul-03 01:10:50 :: [noarch] update OK
2015-Jul-03 01:10:50 :: repo update OK
2015-Jul-03 01:10:57 :: repo save OK
2015-Jul-03 01:10:57 :: updated /gears/m/moodle2.0-lang-eu.git branch `t7'
2015-Jul-03 01:11:02 :: gears update OK
2015-Jul-03 01:11:03 :: task #146040 for t7 DONE
(Continue reading)

[#146036] FAILED playonlinux.git=4.2.8-alt1

http://git.altlinux.org/tasks/146036/logs/events.1.1.log

2015-Jul-03 00:38:29 :: test-only task #146036 for sisyphus started by cas:
#100 build 4.2.8-alt1 from /people/cas/packages/playonlinux.git
2015-Jul-03 00:38:29 :: [i586] #100 playonlinux.git 4.2.8-alt1: build start
2015-Jul-03 00:38:29 :: [x86_64] #100 playonlinux.git 4.2.8-alt1: build start
2015-Jul-03 00:38:45 :: [x86_64] #100 playonlinux.git 4.2.8-alt1: build SKIPPED
2015-Jul-03 00:39:35 :: [i586] #100 playonlinux.git 4.2.8-alt1: build OK
2015-Jul-03 00:39:38 :: build check OK
2015-Jul-03 00:39:38 :: noarch check OK
2015-Jul-03 00:39:39 :: plan: src +1 -1 =17956, i586 +1 -1 =34116
2015-Jul-03 00:39:39 :: version check OK
2015-Jul-03 00:40:29 :: generated apt indices
2015-Jul-03 00:40:30 :: created next repo
2015-Jul-03 00:40:49 :: dependencies check OK
2015-Jul-03 00:40:50 :: ELF symbols check OK
	i586: playonlinux=4.2.8-alt1 install failed:
Reading Package Lists...
Building Dependency Tree...
MI2a: mark playonlinux
MI2a:  target python2.7(wxversion) AMB
MI2b: mark playonlinux
MI2b:  target python2.7(wxversion) AMB
MI2c: mark playonlinux
MI2c:  target python2.7(wxversion)
MI2c:   mark python-module-wx2.9
Starting
Starting 2
Investigating python-module-wx3.0
Package python-module-wx3.0 has broken dep on python-module-wx
(Continue reading)

[#146035] TESTED appstream.git=0.8.2-alt1

http://git.altlinux.org/tasks/146035/logs/events.1.1.log

2015-Jul-03 00:30:06 :: test-only task #146035 for sisyphus started by cas:
#100 build 0.8.2-alt1 from /people/cas/packages/appstream.git
2015-Jul-03 00:30:06 :: [i586] #100 appstream.git 0.8.2-alt1: build start
2015-Jul-03 00:30:06 :: [x86_64] #100 appstream.git 0.8.2-alt1: build start
2015-Jul-03 00:32:05 :: [x86_64] #100 appstream.git 0.8.2-alt1: build OK
2015-Jul-03 00:32:11 :: [i586] #100 appstream.git 0.8.2-alt1: build OK
2015-Jul-03 00:32:18 :: build check OK
2015-Jul-03 00:32:19 :: noarch check OK
2015-Jul-03 00:32:20 :: plan: src +1 -1 =17956, i586 +6 -6 =34116, x86_64 +6 -6 =34046
2015-Jul-03 00:32:20 :: version check OK
2015-Jul-03 00:33:37 :: generated apt indices
2015-Jul-03 00:33:38 :: created next repo
2015-Jul-03 00:33:54 :: dependencies check OK
2015-Jul-03 00:34:21 :: ELF symbols check OK
2015-Jul-03 00:34:51 :: [x86_64] #100 appstream: install check OK
2015-Jul-03 00:34:51 :: [i586] #100 appstream: install check OK
2015-Jul-03 00:35:15 :: [x86_64] #100 appstream-debuginfo: install check OK
2015-Jul-03 00:35:16 :: [i586] #100 appstream-debuginfo: install check OK
2015-Jul-03 00:35:40 :: [x86_64] #100 appstream-devel: install check OK
2015-Jul-03 00:35:42 :: [i586] #100 appstream-devel: install check OK
2015-Jul-03 00:36:01 :: [x86_64] #100 appstream-qt: install check OK
2015-Jul-03 00:36:03 :: [i586] #100 appstream-qt: install check OK
2015-Jul-03 00:36:28 :: [x86_64] #100 appstream-qt-debuginfo: install check OK
2015-Jul-03 00:36:32 :: [i586] #100 appstream-qt-debuginfo: install check OK
	x86_64: appstream-qt-devel=0.8.2-alt1 post-install unowned files:
/usr/lib64/cmake
2015-Jul-03 00:36:49 :: [x86_64] #100 appstream-qt-devel: install check OK
	i586: appstream-qt-devel=0.8.2-alt1 post-install unowned files:
(Continue reading)

[#146033] FAILED gnucash.git=2.6.7-alt1

http://git.altlinux.org/tasks/146033/logs/events.1.1.log

2015-Jul-03 00:28:05 :: test-only task #146033 for sisyphus started by cas:
#100 build 2.6.7-alt1 from /people/cas/packages/gnucash.git
2015-Jul-03 00:28:06 :: [i586] #100 gnucash.git 2.6.7-alt1: build start
2015-Jul-03 00:28:06 :: [x86_64] #100 gnucash.git 2.6.7-alt1: build start
checking for ./src/swig-runtime.h... no
configure: error: 
It looks like you are NOT building from Subversion, svk, git or bzr
2015-Jul-03 00:29:58 :: [x86_64] gnucash.git 2.6.7-alt1: remote: build failed
2015-Jul-03 00:29:58 :: [x86_64] #100 gnucash.git 2.6.7-alt1: build FAILED
checking for ./src/swig-runtime.h... no
configure: error: 
It looks like you are NOT building from Subversion, svk, git or bzr
2015-Jul-03 00:30:05 :: [i586] gnucash.git 2.6.7-alt1: remote: build failed
2015-Jul-03 00:30:05 :: [i586] #100 gnucash.git 2.6.7-alt1: build FAILED
2015-Jul-03 00:29:58 :: [x86_64] build FAILED
2015-Jul-03 00:30:05 :: [i586] build FAILED
2015-Jul-03 00:30:05 :: task #146033 for sisyphus FAILED

Gmane