Derick Rethans | 1 Feb 10:09 2007
Picon
Picon

cvs: qaweb /include rc-md5sums.txt release-qa.php

derick		Thu Feb  1 09:09:36 2007 UTC

  Modified files:              
    /qaweb/include	rc-md5sums.txt release-qa.php 
  Log:
  - Update for new RC.

  
http://cvs.php.net/viewvc.cgi/qaweb/include/rc-md5sums.txt?r1=1.49&r2=1.50&diff_format=u
Index: qaweb/include/rc-md5sums.txt
diff -u qaweb/include/rc-md5sums.txt:1.49 qaweb/include/rc-md5sums.txt:1.50
--- qaweb/include/rc-md5sums.txt:1.49	Fri Jan 26 00:20:10 2007
+++ qaweb/include/rc-md5sums.txt	Thu Feb  1 09:09:36 2007
 <at>  <at>  -1,4 +1,4  <at>  <at> 
-ee9238175c6b6ecec8712954065451c4  php-4.4.5RC1.tar.bz2
-5337c72e3d70fb88b932215957e250f8  php-4.4.5RC1.tar.gz
+a28714c5c7bfa49676fcb81a4a80143c  php-4.4.5RC2.tar.bz2
+476baf76704eea52d78591af444c5d4d  php-4.4.5RC2.tar.gz
 f50578276f653b1f523150e3ff987f03  php-5.2.1RC4.tar.bz2
-361197eb2b21b36e2e20cb132da2cf16  php-5.2.1RC4.tar.gz
\ No newline at end of file
+361197eb2b21b36e2e20cb132da2cf16  php-5.2.1RC4.tar.gz
http://cvs.php.net/viewvc.cgi/qaweb/include/release-qa.php?r1=1.72&r2=1.73&diff_format=u
Index: qaweb/include/release-qa.php
diff -u qaweb/include/release-qa.php:1.72 qaweb/include/release-qa.php:1.73
--- qaweb/include/release-qa.php:1.72	Fri Jan 26 00:20:10 2007
+++ qaweb/include/release-qa.php	Thu Feb  1 09:09:36 2007
 <at>  <at>  -1,12 +1,12  <at>  <at> 
-<?php /* $Id: release-qa.php,v 1.72 2007/01/26 00:20:10 iliaa Exp $ */
+<?php /* $Id: release-qa.php,v 1.73 2007/02/01 09:09:36 derick Exp $ */
(Continue reading)

Derick Rethans | 1 Feb 10:12 2007
X-Face
Picon
Picon

PHP 4.4.5RC2 has been released.

Hello!

You are receiving this email because your project has been select to 
take part in a new effort by the PHP QA Team to make sure that your 
project still works with PHP versions to-be-released. With this we hope 
to make sure that you are either aware of things that might break, or to 
make sure we don't introduce any strange regressions. With this effort 
we hope to build a better relation between the PHP Team and the major 
projects.

If you do not want to receive these heads-up emails, please reply to me 
personally and I will remove you from the list; but, we hope that you 
want to actively help us making PHP a better and more stable tool.

The second release candidate of PHP 4.4.5 can be found at 
http://downloads.php.net/derick/ . If everything goes well, we hope to 
release PHP 4.4.5 at the end of next week. If you find any issues, 
please contact the PHP QA team at "php-qa <at> lists.php.net".

In case you think that other projects should also receive this kinds of 
emails, please let me know privately, and I will add them to the list of 
projects to contact.

regards,
Derick

--

-- 
PHP Quality Assurance Mailing List <http://www.php.net/>
To unsubscribe, visit: http://www.php.net/unsub.php

(Continue reading)

Alan Harder | 2 Feb 01:08 2007
Picon

Re: [Gallery-core] PHP release announcement

Hi-
All 2792 unit tests for Gallery 2 passed on PHP 4.4.5-RC2.
The only thing I noticed was when building this version, I had to remove 
--with-zip=/usr on this particular (debian) system, though this has 
worked with other php versions.. maybe it uses a different library now.
Thanks,

    - Alan

> -------- Original Message --------
> Date: Thu, 1 Feb 2007 10:07:39 +0100 (CET)
> From: Derick Rethans <derick <at> php.net>
> To: PHP Quality Assurance Team Mailing List <php-qa <at> lists.php.net>
>
> Hello!
>
> You are receiving this email because your project has been select to
> take part in a new effort by the PHP QA Team to make sure that your
> project still works with PHP versions to-be-released. With this we hope
> to make sure that you are either aware of things that might break, or to
> make sure we don't introduce any strange regressions. With this effort
> we hope to build a better relation between the PHP Team and the major
> projects.
>
> If you do not want to receive these heads-up emails, please reply to me
> personally and I will remove you from the list; but, we hope that you
> want to actively help us making PHP a better and more stable tool.
>
> The second release candidate of PHP 4.4.5 can be found at
> http://downloads.php.net/derick/ . If everything goes well, we hope to
(Continue reading)

noreply | 2 Feb 14:29 2007
Picon
Picon

Test results for 4.4.5RC2 [failed]


=====================================================================
FAILED TEST SUMMARY
---------------------------------------------------------------------
Bug #35239 (Objects can lose references) [tests/lang/bug35239.phpt]
APC: apc_store/fetch with strings [ext/apc/tests/apc_001.phpt]
APC: apc_store/fetch with objects [ext/apc/tests/apc_002.phpt]
APC: apc_store/fetch with objects [ext/apc/tests/apc_003.phpt]
bug compatibility: unset($c) with enabled register_globals [ext/session/tests/007.phpt]
serializing references test case using globals [ext/session/tests/019.phpt]
=====================================================================

=====================================================================
TEST RESULT SUMMARY
---------------------------------------------------------------------
Exts skipped    :   55
Exts tested     :   32
---------------------------------------------------------------------
Number of tests :  636
Tests skipped   :  142 (22.3%)
Tests warned    :    0 (0.0%)
Tests failed    :    6 (0.9%)
Tests passed    :  488 (76.7%)
---------------------------------------------------------------------
Time taken      :  100 seconds
=====================================================================

================================================================================
/root/php4/php-4.4.5RC2/tests/lang/bug35239.phpt
================================================================================
(Continue reading)

Sander | 9 Feb 01:44 2007
Picon
Picon

Hi, what's up?

--

-- 
PHP Quality Assurance Mailing List <http://www.php.net/>
To unsubscribe, visit: http://www.php.net/unsub.php
Antony Dovgal | 9 Feb 13:42 2007
Picon
Picon

cvs: qaweb /include release-qa.php

tony2001		Fri Feb  9 12:42:04 2007 UTC

  Modified files:              
    /qaweb/include	release-qa.php 
  Log:
  update by bjori

  
http://cvs.php.net/viewvc.cgi/qaweb/include/release-qa.php?r1=1.73&r2=1.74&diff_format=u
Index: qaweb/include/release-qa.php
diff -u qaweb/include/release-qa.php:1.73 qaweb/include/release-qa.php:1.74
--- qaweb/include/release-qa.php:1.73	Thu Feb  1 09:09:36 2007
+++ qaweb/include/release-qa.php	Fri Feb  9 12:42:04 2007
 <at>  <at>  -1,4 +1,4  <at>  <at> 
-<?php /* $Id: release-qa.php,v 1.73 2007/02/01 09:09:36 derick Exp $ */
+<?php /* $Id: release-qa.php,v 1.74 2007/02/09 12:42:04 tony2001 Exp $ */

 /*
  *  This file generates the "Providing QA for PHP x.x.x.." task item
 <at>  <at>  -6,8 +6,10  <at>  <at> 
  */

 $CURRENT_QA_RELEASE = "4.4.5RC2";
-$BUILD_TEST_RELEASES = array( '4.4.5RC2' , '5.2.1RC4');
-$RELEASE_PROCESS = true;
+$BUILD_TEST_RELEASES = array( '4.4.5RC2', '5.2.1');
+
+$RELEASE_PROCESS = array(4 => true, 5 => false);
+
 $RC_FILES = array (
 	array (	
 		'http://downloads.php.net/derick/',
 <at>  <at>  -26,7 +28,7  <at>  <at> 
 );

 /* PHP 5 Releases */
-$CURRENT_QA_RELEASE_5 = '5.2.1RC4';
+$CURRENT_QA_RELEASE_5 = false; #'5.2.2RC1';
 $RC_FILES_5 = array (

 	array (	
 <at>  <at>  -63,11 +65,32  <at>  <at> 
 		'http://snaps.php.net/win32/',
 		'php4-win32-STABLE-latest.zip',
 	),
+	array (
+		'http://snaps.php.net/',
+		'php5.2-latest.tar.bz2',
+	),
+	array (
+		'http://snaps.php.net/',
+		'php5.2-latest.tar.gz',
+	),
+	array (
+		'http://snaps.php.net/win32/',
+		'php5.2-win32-latest.zip'
+	),
 );

-if ($RELEASE_PROCESS) {
-	$FILES = array_merge($RC_FILES, $RC_FILES_5);
+if ($RELEASE_PROCESS[4] || $RELEASE_PROCESS[5]) {
 	$MD5SUM = file('include/rc-md5sums.txt');
+	if($RELEASE_PROCESS[4] && $RELEASE_PROCESS[5]) {
+		$FILES = array_merge($RC_FILES, $RC_FILES_5);
+	} elseif($RELEASE_PROCESS[4]) {
+		$FILES = $RC_FILES;
+	} elseif($RELEASE_PROCESS[5]) {
+		$FILES = $RC_FILES_5;
+	} else {
+		$FILES = $SNAPSHOTS;
+		$MD5SUM = array();
+	}
 } else {
 	$FILES = $SNAPSHOTS;
 	$MD5SUM = array();

--

-- 
PHP Quality Assurance Mailing List <http://www.php.net/>
To unsubscribe, visit: http://www.php.net/unsub.php

Antony Dovgal | 9 Feb 14:04 2007
Picon
Picon

cvs: qaweb /include functions.php

tony2001		Fri Feb  9 13:04:57 2007 UTC

  Modified files:              
    /qaweb/include	functions.php 
  Log:
  bump copyright year

  
http://cvs.php.net/viewvc.cgi/qaweb/include/functions.php?r1=1.9&r2=1.10&diff_format=u
Index: qaweb/include/functions.php
diff -u qaweb/include/functions.php:1.9 qaweb/include/functions.php:1.10
--- qaweb/include/functions.php:1.9	Sat Jan 18 22:33:15 2003
+++ qaweb/include/functions.php	Fri Feb  9 13:04:57 2007
 <at>  <at>  -3,7 +3,7  <at>  <at> 
 (c)'2001 by Marco Kaiser (bate <at> php.net) and the PHP Group 	
 Read an Learn. Any Questions so ask. 						

-Version: $Id: functions.php,v 1.9 2003/01/18 22:33:15 derick Exp $
+Version: $Id: functions.php,v 1.10 2007/02/09 13:04:57 tony2001 Exp $
 */

 function common_header() {
 <at>  <at>  -130,7 +130,7  <at>  <at> 
         <tr> 
           <td width="80" align="center"><a href="http://www.php.net/"><img src="gfx/php-logo.gif"
width="69" height="36" border="0" alt="Go to the main PHP site"></a></td>
           <td class="footer"><a href="http://www.php.net/copyright.php" target="_blank">Copyright 
-            &copy; 1997 - 2003 PHP Group</a><br>
+            &copy; 1997 - 2007 PHP Group</a><br>
             All rights reserved.</td>
         </tr>
       </table>

--

-- 
PHP Quality Assurance Mailing List <http://www.php.net/>
To unsubscribe, visit: http://www.php.net/unsub.php

noreply | 9 Feb 18:02 2007
Picon
Picon

Test results for 5.2.1 [failed]


=====================================================================
FAILED TEST SUMMARY
---------------------------------------------------------------------
Test for buffering in core functions with implicit flush off [tests/func/008.phpt]
Bug #30638 (localeconv returns wrong LC_NUMERIC settings) [tests/lang/bug30638.phpt]
Bug #39602 (Invalid session.save_handler crashes PHP) [Zend/tests/bug39602.phpt]
Bug #38474 (getAttribute select attribute by order, even when prefixed) (OK to fail with libxml2 < 2.6.2x) [ext/dom/tests/bug38474.phpt]
HTML input/output [ext/mbstring/tests/htmlent.phpt]
mb_output_handler() (Shift_JIS) [ext/mbstring/tests/mb_output_handler_shift_jis.phpt]
SPL: SplObjectStorage serialization [ext/spl/tests/observer_003.phpt]
SPL: SplObjectStorage serialization & overloading [ext/spl/tests/observer_004.phpt]
SPL: SplObjectStorage serialization & visibility [ext/spl/tests/observer_005.phpt]
Sort with SORT_LOCALE_STRING [ext/standard/tests/array/locale_sort.phpt]
Bug #22414 (passthru() does not read data correctly) [ext/standard/tests/file/bug22414.phpt]
inet_ntop() & inet_pton() tests [ext/standard/tests/network/inet.phpt]
htmlentities() test 4 (setlocale / ja_JP.EUC-JP) [ext/standard/tests/strings/htmlentities04.phpt]
htmlentities() test 15 (setlocale / KOI8-R) [ext/standard/tests/strings/htmlentities15.phpt]
Generic pack()/unpack() tests [ext/standard/tests/strings/pack.phpt]
=====================================================================

=====================================================================
TEST RESULT SUMMARY
---------------------------------------------------------------------
Exts skipped    :   49
Exts tested     :   30
---------------------------------------------------------------------

Number of tests : 2990              1802
Tests skipped   : 1188 ( 39.7%) --------
Tests warned    :    1 (  0.0%) (  0.1%)
Tests failed    :   15 (  0.5%) (  0.8%)
Tests passed    : 1786 ( 59.7%) ( 99.1%)
---------------------------------------------------------------------
Time taken      :  385 seconds
=====================================================================

=====================================================================
FAILED TEST SUMMARY
---------------------------------------------------------------------
Test for buffering in core functions with implicit flush off [tests/func/008.phpt]
Bug #30638 (localeconv returns wrong LC_NUMERIC settings) [tests/lang/bug30638.phpt]
Bug #39602 (Invalid session.save_handler crashes PHP) [Zend/tests/bug39602.phpt]
Bug #38474 (getAttribute select attribute by order, even when prefixed) (OK to fail with libxml2 < 2.6.2x) [ext/dom/tests/bug38474.phpt]
HTML input/output [ext/mbstring/tests/htmlent.phpt]
mb_output_handler() (Shift_JIS) [ext/mbstring/tests/mb_output_handler_shift_jis.phpt]
SPL: SplObjectStorage serialization [ext/spl/tests/observer_003.phpt]
SPL: SplObjectStorage serialization & overloading [ext/spl/tests/observer_004.phpt]
SPL: SplObjectStorage serialization & visibility [ext/spl/tests/observer_005.phpt]
Sort with SORT_LOCALE_STRING [ext/standard/tests/array/locale_sort.phpt]
Bug #22414 (passthru() does not read data correctly) [ext/standard/tests/file/bug22414.phpt]
inet_ntop() & inet_pton() tests [ext/standard/tests/network/inet.phpt]
htmlentities() test 4 (setlocale / ja_JP.EUC-JP) [ext/standard/tests/strings/htmlentities04.phpt]
htmlentities() test 15 (setlocale / KOI8-R) [ext/standard/tests/strings/htmlentities15.phpt]
Generic pack()/unpack() tests [ext/standard/tests/strings/pack.phpt]
=====================================================================

================================================================================
/usr/local/src/php-5.2.1/tests/func/008.phpt
================================================================================

================================================================================
001- 'foo1'
003- 'foo2'
================================================================================

================================================================================
/usr/local/src/php-5.2.1/tests/lang/bug30638.phpt
================================================================================
decimal_point: ,
thousands_sep:
================================================================================
002+ thousands_sep:
002- thousands_sep: .
================================================================================

================================================================================
/usr/local/src/php-5.2.1/Zend/tests/bug39602.phpt
================================================================================
ok
================================================================================
002- Fatal error: Unknown: Cannot find save handler qwerty in Unknown on line 0
================================================================================

================================================================================
/usr/local/src/php-5.2.1/ext/dom/tests/bug38474.phpt
================================================================================
foo
bar
foo2
bar

baz2
================================================================================
004+ bar
005+ 
006+ 
004- bar2
005- baz
008- baz
================================================================================

================================================================================
/usr/local/src/php-5.2.1/ext/mbstring/tests/htmlent.phpt
================================================================================

================================================================================
001+ 
001- HTML-ENTITIES>UTF-8>HTML-ENTITIES
002- Array
003- (
004-     [test] => & <at> AB&#128;&#129;&#130;&auml;&ouml;&uuml;&euro;&lang;&rang;
005- )
006- ===DONE===
================================================================================

================================================================================
/usr/local/src/php-5.2.1/ext/mbstring/tests/mb_output_handler_shift_jis.phpt
================================================================================

================================================================================
001+ 
001- string(73) "¥Æ¥¹¥ÈÍÑÆüËܸìʸ»úÎ󡣤³¤Î¥â¥¸¥å¡¼¥ë¤ÏPHP¤Ë¥Þ¥ë¥Á¥Ð¥¤¥È´Ø¿ô¤òÄ󶡤·¤Þ¤¹¡£"
================================================================================

================================================================================
/usr/local/src/php-5.2.1/ext/spl/tests/observer_003.phpt
================================================================================
int(4)
int(1)
string(1) "2"
string(3) "foo"
bool(true)
string(28) "O:16:"SplObjectStorage":0:{}"
===UNSERIALIZE===
int(0)
===DONE===
================================================================================
008+ int(0)
008- int(4)
009- int(1)
010- string(1) "2"
011- string(3) "foo"
012- bool(true)
================================================================================

================================================================================
/usr/local/src/php-5.2.1/ext/spl/tests/observer_004.phpt
================================================================================
int(2)
int(1)
int(2)
object(MyStorage)#1 (1) {
  ["bla"]=>
  int(26)
}
string(35) "O:9:"MyStorage":1:{s:3:"bla";i:26;}"
===UNSERIALIZE===
int(0)
object(MyStorage)#4 (1) {
  ["bla"]=>
  int(26)
}
===DONE===
================================================================================
010+ int(0)
010- int(2)
011- int(1)
012- int(2)
================================================================================

================================================================================
/usr/local/src/php-5.2.1/ext/spl/tests/observer_005.phpt
================================================================================
int(2)
object(TestClass)#2 (4) {
  ["def"]=>
  int(24)
  ["pub"]=>
  int(4)
  ["pro:protected"]=>
  int(5)
  ["pri:private"]=>
  int(6)
}
object(TestClass)#3 (4) {
  ["def"]=>
  int(24)
  ["pub"]=>
  int(7)
  ["pro:protected"]=>
  int(8)
  ["pri:private"]=>
  int(9)
}
object(MyStorage)#1 (4) {
  ["def"]=>
  int(24)
  ["pub"]=>
  int(1)
  ["pro:protected"]=>
  int(2)
  ["pri:private"]=>
  int(3)
}
string(92) "O:9:"MyStorage":4:{s:3:"def";i:24;s:3:"pub";i:1;s:6:"[0x0]*[0x0]pro";i:2;s:14:"[0x0]MyStorage[0x0]pri";i:3;}"
===UNSERIALIZE===
int(0)
object(MyStorage)#4 (4) {
  ["def"]=>
  int(24)
  ["pub"]=>
  int(1)
  ["pro:protected"]=>
  int(2)
  ["pri:private"]=>
  int(3)
}
===DONE===
================================================================================
034+ int(0)
035+ object(MyStorage)#4 (4) {
034- int(2)
035- object(TestClass)#%d (4) {
039+   int(1)
039-   int(4)
041+   int(2)
041-   int(5)
043+   int(3)
043-   int(6)
045+ ===DONE===
045- object(TestClass)#%d (4) {
046-   ["def"]=>
047-   int(24)
048-   ["pub"]=>
049-   int(7)
050-   ["pro:protected"]=>
051-   int(8)
052-   ["pri:private"]=>
053-   int(9)
054- }
055- object(MyStorage)#%d (4) {
056-   ["def"]=>
057-   int(24)
058-   ["pub"]=>
059-   int(1)
060-   ["pro:protected"]=>
061-   int(2)
062-   ["pri:private"]=>
063-   int(3)
064- }
065- ===DONE===
================================================================================

================================================================================
/usr/local/src/php-5.2.1/ext/standard/tests/array/locale_sort.phpt
================================================================================
array(13) {
  ["AB"]=>
  string(7) "Alberta"
  ["BC"]=>
  string(20) "Colombie-Britannique"
  ["MB"]=>
  string(8) "Manitoba"
  ["NB"]=>
  string(17) "Nouveau-Brunswick"
  ["NS"]=>
  string(15) "Nouvelle-Écosse"
  ["NU"]=>
  string(7) "Nunavut"
  ["ON"]=>
  string(7) "Ontario"
  ["QC"]=>
  string(6) "Québec"
  ["SK"]=>
  string(12) "Saskatchewan"
  ["NL"]=>
  string(23) "Terre-Neuve-et-Labrador"
  ["YT"]=>
  string(19) "Territoire du Yukon"
  ["NT"]=>
  string(25) "Territoires du Nord-Ouest"
  ["PE"]=>
  string(21) "Île-du-Prince-Édouard"
}
================================================================================
006-   ["PE"]=>
007-   string(21) "Île-du-Prince-Édouard"
026+   ["PE"]=>
027+   string(21) "Île-du-Prince-Édouard"
================================================================================

================================================================================
/usr/local/src/php-5.2.1/ext/standard/tests/file/bug22414.phpt
================================================================================
HELLO
sh: line 1: /usr/local/php/bin/php: No such file or directory
Does not work
================================================================================
002+ sh: line 1: /usr/local/php/bin/php: No such file or directory
002- Works
003+ Does not work
================================================================================

================================================================================
/usr/local/src/php-5.2.1/ext/standard/tests/network/inet.phpt
================================================================================
string(9) "127.0.0.1"
string(13) "255.255.255.0"
string(10) "::0.0.0.38"

Warning: inet_ntop() expects exactly 1 parameter, 0 given in
/usr/local/src/php-5.2.1/ext/standard/tests/network/inet.php on line 12
bool(false)

Warning: inet_ntop(): Invalid in_addr value in
/usr/local/src/php-5.2.1/ext/standard/tests/network/inet.php on line 13
bool(false)

Warning: inet_ntop(): Invalid in_addr value in
/usr/local/src/php-5.2.1/ext/standard/tests/network/inet.php on line 14
bool(false)

Warning: inet_ntop(): Invalid in_addr value in
/usr/local/src/php-5.2.1/ext/standard/tests/network/inet.php on line 15
bool(false)

Warning: inet_pton() expects exactly 1 parameter, 0 given in
/usr/local/src/php-5.2.1/ext/standard/tests/network/inet.php on line 17
bool(false)

Warning: inet_pton(): Unrecognized address  in
/usr/local/src/php-5.2.1/ext/standard/tests/network/inet.php on line 18
bool(false)

Warning: inet_pton(): Unrecognized address -1 in
/usr/local/src/php-5.2.1/ext/standard/tests/network/inet.php on line 19
bool(false)

Warning: inet_pton(): Unrecognized address abra in
/usr/local/src/php-5.2.1/ext/standard/tests/network/inet.php on line 20
bool(false)
string(4) "[0x0][0x0]"
string(9) "127.0.0.1"
string(4) "B£¡t"
string(14) "66.163.161.116"
string(4) "ÿÿÿÿ"
string(15) "255.255.255.255"
string(4) "[0x0][0x0][0x0][0x0]"
string(7) "0.0.0.0"
Done
================================================================================
003+ string(10) "::0.0.0.38"
003- string(4) "::26"
================================================================================

================================================================================
/usr/local/src/php-5.2.1/ext/standard/tests/strings/htmlentities04.phpt
================================================================================
string(42) "&iexcl;&cent;&iexcl;&pound;&iexcl;&curren;"
================================================================================
001+ string(42) "&iexcl;&cent;&iexcl;&pound;&iexcl;&curren;"
001- string(6) "¡¢¡£¡¤"
================================================================================

================================================================================
/usr/local/src/php-5.2.1/ext/standard/tests/strings/htmlentities15.phpt
================================================================================
string(9) "ÒÏÓËÏÛÎÙÊ"
string(63) "&Ograve;&Iuml;&Oacute;&Euml;&Iuml;&Ucirc;&Icirc;&Ugrave;&Ecirc;"
================================================================================
002+ string(63) "&Ograve;&Iuml;&Oacute;&Euml;&Iuml;&Ucirc;&Icirc;&Ugrave;&Ecirc;"
002- string(63) "&#1088;&#1086;&#1089;&#1082;&#1086;&#1096;&#1085;&#1099;&#1081;"
================================================================================

================================================================================
/usr/local/src/php-5.2.1/ext/standard/tests/strings/pack.phpt
================================================================================
Array
(
    [1] => h
)
Array
(
    [1] => hello world
)
"hello    "
Array
(
    [1] => 129
)
Array
(
    [1] => 127
)
Array
(
    [1] => 255
)
Array
(
    [1] => 127
)
Array
(
    [1] => 4
)
Array
(
    [1] => 65534
)
Array
(
    [1] => 0
)
Array
(
    [1] => -1000
)
Array
(
    [1] => -64434
)
Array
(
    [1] => -1
)
Array
(
    [1] => -2147483648
)
Array
(
    [1] => 65534
)
Array
(
    [1] => 0
)
Array
(
    [1] => -2147483646
)
Array
(
    [1] => -1
)
Array
(
    [1] => -2147483648
)
Array
(
    [1] => 65534
)
Array
(
    [1] => 0
)
Array
(
    [1] => -2147483646
)
Array
(
    [1] => -1
)
Array
(
    [1] => -2147483648
)
Array
(
    [1] => -30000
)
Array
(
    [1] => 65534
)
Array
(
    [1] => 1
)
Array
(
    [1] => 0
)
Array
(
    [1] => 64536
)
Array
(
    [1] => 1102
)
Array
(
    [1] => 1
)
Array
(
    [1] => 65534
)
Array
(
    [1] => 0
)
Array
(
    [1] => -2147483646
)
Array
(
    [1] => -1
)
Array
(
    [1] => -2147483648
)
Array
(
    [1] => h
)
Array
(
    [1] => hello world
)
Array
(
    [1] => -127
)
Array
(
    [1] => 127
)
Array
(
    [1] => -1
)
Array
(
    [1] => 127
)
Array
(
    [1] => 3
)
Array
(
    [1] => 65534
)
Array
(
    [1] => 0
)
Array
(
    [1] => -1000
)
Array
(
    [1] => -64434
)
Array
(
    [1] => -65535
)
Array
(
    [1] => -2147483647
)
Array
(
    [1] => 65534
)
Array
(
    [1] => 0
)
Array
(
    [1] => -2147483646
)
Array
(
    [1] => -1
)
Array
(
    [1] => -2147483648
)
Array
(
    [1] => 65534
)
Array
(
    [1] => 1
)
Array
(
    [1] => 0
)
Array
(
    [1] => 64536
)
Array
(
    [1] => 1102
)
Array
(
    [1] => 1
)
Array
(
    [1] => 32767
)
Array
(
    [1] => -1
)
Array
(
    [1] => 0
)
Array
(
    [1] => -1000
)
Array
(
    [1] => 1102
)
Array
(
    [1] => 1
)
Array
(
    [1] => 65534
)
Array
(
    [1] => 1
)
Array
(
    [1] => 0
)
Array
(
    [1] => 64536
)
Array
(
    [1] => 1102
)
Array
(
    [1] => 1
)
================================================================================
048+     [1] => -1
048-     [1] => 0
088+     [1] => -1
088-     [1] => 0
136+     [1] => -1
136-     [1] => 0
208+     [1] => -1
208-     [1] => 0
================================================================================

================================================================================
BUILD ENVIRONMENT
================================================================================
OS:
Darwin - Darwin 64-190-225-165.static.cypresscom.net 8.8.0 Darwin Kernel Version 8.8.0: Fri Sep  8
17:18:57 PDT 2006; root:xnu-792.12.6.obj~1/RELEASE_PPC Power Macintosh

Autoconf:
autoconf (GNU Autoconf) 2.59
Written by David J. MacKenzie and Akim Demaille.

Copyright (C) 2003 Free Software Foundation, Inc.
This is free software; see the source for copying conditions.  There is NO
warranty; not even for MERCHANTABILITY or FITNESS FOR A PARTICULAR PURPOSE.

Bundled Libtool:
ltmain.sh (GNU libtool) 1.5.20 (1.1220.2.287 2005/08/31 18:54:15)

Copyright (C) 2005  Free Software Foundation, Inc.
This is free software; see the source for copying conditions.  There is NO
warranty; not even for MERCHANTABILITY or FITNESS FOR A PARTICULAR PURPOSE.

System Libtool:
ltmain.sh (GNU libtool) 1.5 (1.1220 2003/04/05 19:32:58)

Copyright (C) 2003  Free Software Foundation, Inc.
This is free software; see the source for copying conditions.  There is NO
warranty; not even for MERCHANTABILITY or FITNESS FOR A PARTICULAR PURPOSE.

Compiler:
Reading specs from /usr/lib/gcc/powerpc-apple-darwin8/4.0.0/specs
Configured with: /private/var/tmp/gcc/gcc-4061.obj~8/src/configure --disable-checking
--prefix=/usr --mandir=/share/man --enable-languages=c,objc,c++,obj-c++
--program-transform-name=/^[cg][^+.-]*$/s/$/-4.0/
--with-gxx-include-dir=/include/gcc/darwin/4.0/c++ --build=powerpc-apple-darwin8
--host=powerpc-apple-darwin8 --target=powerpc-apple-darwin8
Thread model: posix
gcc version 4.0.0 20041026 (Apple Computer, Inc. build 4061)

Bison:
GNU Bison version 1.28

Libraries:

User's E-mail: pbnagel at rmi dot net

================================================================================
PHPINFO
================================================================================
phpinfo()
PHP Version => 5.2.1

System => Darwin 64-190-225-165.static.cypresscom.net 8.8.0 Darwin Kernel Version 8.8.0: Fri Sep  8
17:18:57 PDT 2006; root:xnu-792.12.6.obj~1/RELEASE_PPC Power Macintosh
Build Date => Feb  9 2007 09:24:05
Configure Command =>  './configure' '--with-zlib' '--with-xml' '--enable-cli' '--enable-exif'
'--enable-ftp' '--enable-mbstring' '--enable-mbregex' '--enable-dbx' '--enable-sockets'
'--enable-suhosin' '--with-apxs2=/usr/local/apache2/bin/apxs' '--enable-force-cgi-redirect'
'--enable-discard-path' '--enable-fastcgi' '--enable-safe-mode' '--with-pspell'
'--with-mysql=/usr/local/mysql' '--with-mysql-sock=/tmp'
'--with-mysqli=/usr/local/mysql/bin/mysql_config' '--with-PEAR=/usr/local/lib/php'
Server API => Command Line Interface
Virtual Directory Support => disabled
Configuration File (php.ini) Path => /usr/local/lib/php.ini
PHP API => 20041225
PHP Extension => 20060613
Zend Extension => 220060519
Debug Build => no
Thread Safety => disabled
Zend Memory Manager => enabled
IPv6 Support => enabled
Registered PHP Streams => php, file, data, http, ftp, compress.zlib  
Registered Stream Socket Transports => tcp, udp, unix, udg
Registered Stream Filters => string.rot13, string.toupper, string.tolower, string.strip_tags,
convert.*, consumed, convert.iconv.*, zlib.*

This program makes use of the Zend Scripting Language Engine:
Zend Engine v2.2.0, Copyright (c) 1998-2007 Zend Technologies

 _______________________________________________________________________

Configuration

PHP Core

Directive => Local Value => Master Value
allow_call_time_pass_reference => Off => Off
allow_url_fopen => On => On
allow_url_include => Off => Off
always_populate_raw_post_data => Off => Off
arg_separator.input => & => &
arg_separator.output => & => &
asp_tags => Off => Off
auto_append_file => no value => no value
auto_globals_jit => On => On
auto_prepend_file => no value => no value
browscap => no value => no value
default_charset => no value => no value
default_mimetype => text/html => text/html
define_syslog_variables => Off => Off
disable_classes => no value => no value
disable_functions => no value => no value
display_errors => Off => Off
display_startup_errors => Off => Off
doc_root => no value => no value
docref_ext => no value => no value
docref_root => no value => no value
enable_dl => On => On
error_append_string => no value => no value
error_log => /var/log/php.log => /var/log/php.log
error_prepend_string => no value => no value
error_reporting => 6143 => 6143
expose_php => Off => Off
extension_dir => ./ => ./
file_uploads => Off => Off
highlight.bg => <font style="color: #FFFFFF">#FFFFFF</font> => <font style="color: #FFFFFF">#FFFFFF</font>
highlight.comment => <font style="color: #FF8000">#FF8000</font> => <font style="color: #FF8000">#FF8000</font>
highlight.default => <font style="color: #0000BB">#0000BB</font> => <font style="color: #0000BB">#0000BB</font>
highlight.html => <font style="color: #000000">#000000</font> => <font style="color: #000000">#000000</font>
highlight.keyword => <font style="color: #007700">#007700</font> => <font style="color: #007700">#007700</font>
highlight.string => <font style="color: #DD0000">#DD0000</font> => <font style="color: #DD0000">#DD0000</font>
html_errors => Off => Off
ignore_repeated_errors => Off => Off
ignore_repeated_source => Off => Off
ignore_user_abort => On => On
implicit_flush => On => On
include_path => .:/php/includes:/usr/local/lib/php => .:/php/includes:/usr/local/lib/php
log_errors => On => On
log_errors_max_len => 1024 => 1024
magic_quotes_gpc => Off => Off
magic_quotes_runtime => Off => Off
magic_quotes_sybase => Off => Off
mail.force_extra_parameters => no value => no value
max_execution_time => 0 => 0
max_input_time => -1 => -1
memory_limit => 16M => 16M
open_basedir => no value => no value
output_buffering => 0 => 0
output_handler => no value => no value
post_max_size => 8M => 8M
precision => 14 => 14
realpath_cache_size => 16K => 16K
realpath_cache_ttl => 120 => 120
register_argc_argv => On => On
register_globals => Off => Off
register_long_arrays => Off => Off
report_memleaks => On => On
report_zend_debug => Off => Off
safe_mode => Off => Off
safe_mode_exec_dir => no value => no value
safe_mode_gid => Off => Off
safe_mode_include_dir => no value => no value
sendmail_from => no value => no value
sendmail_path => /usr/sbin/sendmail -t -i  => /usr/sbin/sendmail -t -i 
serialize_precision => 100 => 100
short_open_tag => Off => Off
SMTP => localhost => localhost
smtp_port => 25 => 25
sql.safe_mode => Off => Off
track_errors => Off => Off
unserialize_callback_func => no value => no value
upload_max_filesize => 2M => 2M
upload_tmp_dir => no value => no value
user_dir => no value => no value
variables_order => GPCS => GPCS
xmlrpc_error_number => 0 => 0
xmlrpc_errors => Off => Off
y2k_compliance => On => On
zend.ze1_compatibility_mode => Off => Off

ctype

ctype functions => enabled

date

date/time support => enabled
Timezone Database Version => 2006.16
Timezone Database => internal
Default timezone => America/Denver

Directive => Local Value => Master Value
date.default_latitude => 31.7667 => 31.7667
date.default_longitude => 35.2333 => 35.2333
date.sunrise_zenith => 90.583333 => 90.583333
date.sunset_zenith => 90.583333 => 90.583333
date.timezone => no value => no value

dom

DOM/XML => enabled
DOM/XML API Version => 20031129
libxml Version => 2.6.16
HTML Support => enabled
XPath Support => enabled
XPointer Support => enabled
Schema Support => enabled
RelaxNG Support => enabled

exif

EXIF Support => enabled
EXIF Version => 1.4 $Id: exif.c,v 1.173.2.5.2.11 2007/01/23 00:23:17 iliaa Exp $
Supported EXIF Version => 0220
Supported filetypes => JPEG,TIFF

filter

Input Validation and Filtering => enabled
Revision => $Revision: 1.52.2.38 $

Directive => Local Value => Master Value
filter.default => unsafe_raw => unsafe_raw
filter.default_flags => no value => no value

ftp

FTP support => enabled

hash

hash support => enabled
Hashing Engines => md2 md4 md5 sha1 sha256 sha384 sha512 ripemd128 ripemd160 ripemd256 ripemd320
whirlpool tiger128,3 tiger160,3 tiger192,3 tiger128,4 tiger160,4 tiger192,4 snefru gost adler32
crc32 crc32b haval128,3 haval160,3 haval192,3 haval224,3 haval256,3 haval128,4 haval160,4
haval192,4 haval224,4 haval256,4 haval128,5 haval160,5 haval192,5 haval224,5 haval256,5 

iconv

iconv support => enabled
iconv implementation => libiconv
iconv library version => 1.10

Directive => Local Value => Master Value
iconv.input_encoding => ISO-8859-1 => ISO-8859-1
iconv.internal_encoding => ISO-8859-1 => ISO-8859-1
iconv.output_encoding => ISO-8859-1 => ISO-8859-1

json

json support => enabled
json version => 1.2.1

libxml

libXML support => active
libXML Version => 2.6.16
libXML streams => enabled

mbstring

Multibyte Support => enabled
Multibyte string engine => libmbfl
Multibyte (japanese) regex support => enabled
Multibyte regex (oniguruma) version => 4.4.4
Multibyte regex (oniguruma) backtrack check => On

mbstring extension makes use of "streamable kanji code filter and converter", which is distributed under
the GNU Lesser General Public License version 2.1.

Directive => Local Value => Master Value
mbstring.detect_order => no value => no value
mbstring.encoding_translation => Off => Off
mbstring.func_overload => 0 => 0
mbstring.http_input => pass => pass
mbstring.http_output => pass => pass
mbstring.internal_encoding => ISO-8859-1 => no value
mbstring.language => neutral => neutral
mbstring.strict_detection => Off => Off
mbstring.substitute_character => no value => no value

mysql

MySQL Support => enabled
Active Persistent Links => 0
Active Links => 0
Client API version => 5.0.27
MYSQL_MODULE_TYPE => external
MYSQL_SOCKET => /tmp/mysql.sock
MYSQL_INCLUDE => -I/usr/local/mysql/include
MYSQL_LIBS => -L/usr/local/mysql/lib -lmysqlclient 

Directive => Local Value => Master Value
mysql.allow_persistent => On => On
mysql.connect_timeout => 60 => 60
mysql.default_host => no value => no value
mysql.default_password => no value => no value
mysql.default_port => no value => no value
mysql.default_socket => no value => no value
mysql.default_user => no value => no value
mysql.max_links => Unlimited => Unlimited
mysql.max_persistent => Unlimited => Unlimited
mysql.trace_mode => Off => Off

mysqli

MysqlI Support => enabled
Client API library version => 5.0.27
Client API header version => 5.0.27
MYSQLI_SOCKET => /tmp/mysql.sock

Directive => Local Value => Master Value
mysqli.default_host => no value => no value
mysqli.default_port => 3306 => 3306
mysqli.default_pw => no value => no value
mysqli.default_socket => no value => no value
mysqli.default_user => no value => no value
mysqli.max_links => Unlimited => Unlimited
mysqli.reconnect => Off => Off

pcre

PCRE (Perl Compatible Regular Expressions) Support => enabled
PCRE Library Version => 6.7 04-Jul-2006

PDO

PDO support => enabled
PDO drivers => sqlite2, sqlite

pdo_sqlite

PDO Driver for SQLite 3.x => enabled
PECL Module version => (bundled) 1.0.1 $Id: pdo_sqlite.c,v 1.10.2.6.2.1 2007/01/01 09:36:05 sebastian
Exp $
SQLite Library => 3.3.7

posix

Revision => $Revision: 1.70.2.3.2.12 $

pspell

PSpell Support => enabled

Reflection

Reflection => enabled
Version => $Id: php_reflection.c,v 1.164.2.33.2.33 2007/01/01 09:36:05 sebastian Exp $

session

Session Support => enabled
Registered save handlers => files user sqlite 
Registered serializer handlers => php php_binary 

Directive => Local Value => Master Value
session.auto_start => Off => Off
session.bug_compat_42 => Off => Off
session.bug_compat_warn => On => On
session.cache_expire => 180 => 180
session.cache_limiter => nocache => nocache
session.cookie_domain => no value => no value
session.cookie_httponly => Off => Off
session.cookie_lifetime => 0 => 0
session.cookie_path => / => /
session.cookie_secure => Off => Off
session.entropy_file => no value => no value
session.entropy_length => 0 => 0
session.gc_divisor => 1000 => 1000
session.gc_maxlifetime => 1440 => 1440
session.gc_probability => 1 => 1
session.hash_bits_per_character => 5 => 5
session.hash_function => 0 => 0
session.name => PHPSESSID => PHPSESSID
session.referer_check => no value => no value
session.save_handler => files => files
session.save_path => no value => no value
session.serialize_handler => php => php
session.use_cookies => On => On
session.use_only_cookies => Off => Off
session.use_trans_sid => 0 => 0

SimpleXML

Simplexml support => enabled
Revision => $Revision: 1.151.2.22.2.20 $
Schema support => enabled

sockets

Sockets Support => enabled

SPL

SPL support => enabled
Interfaces => Countable, OuterIterator, RecursiveIterator, SeekableIterator, SplObserver, SplSubject
Classes => AppendIterator, ArrayIterator, ArrayObject, BadFunctionCallException,
BadMethodCallException, CachingIterator, DirectoryIterator, DomainException, EmptyIterator,
FilterIterator, InfiniteIterator, InvalidArgumentException, IteratorIterator,
LengthException, LimitIterator, LogicException, NoRewindIterator, OutOfBoundsException,
OutOfRangeException, OverflowException, ParentIterator, RangeException,
RecursiveArrayIterator, RecursiveCachingIterator, RecursiveDirectoryIterator,
RecursiveFilterIterator, RecursiveIteratorIterator, RecursiveRegexIterator, RegexIterator,
RuntimeException, SimpleXMLIterator, SplFileInfo, SplFileObject, SplObjectStorage,
SplTempFileObject, UnderflowException, UnexpectedValueException

SQLite

SQLite support => enabled
PECL Module version => 2.0-dev $Id: sqlite.c,v 1.166.2.13.2.6 2007/01/01 09:36:07 sebastian Exp $
SQLite Library => 2.8.17
SQLite Encoding => iso8859

Directive => Local Value => Master Value
sqlite.assoc_case => 0 => 0

standard

Regex Library => Bundled library enabled
Dynamic Library Support => enabled
Path to sendmail => /usr/sbin/sendmail -t -i 

Directive => Local Value => Master Value
assert.active => 1 => 1
assert.bail => 0 => 0
assert.callback => no value => no value
assert.quiet_eval => 0 => 0
assert.warning => 1 => 1
auto_detect_line_endings => 0 => 0
default_socket_timeout => 60 => 60
safe_mode_allowed_env_vars => PHP_ => PHP_
safe_mode_protected_env_vars => LD_LIBRARY_PATH => LD_LIBRARY_PATH
url_rewriter.tags => a=href,area=href,frame=src,input=src,form=fakeentry => a=href,area=href,frame=src,input=src,form=fakeentry
user_agent => no value => no value

tokenizer

Tokenizer Support => enabled

xml

XML Support => active
XML Namespace Support => active
libxml2 Version => 2.6.16

xmlreader

XMLReader => enabled

xmlwriter

XMLWriter => enabled

zlib

ZLib Support => enabled
Stream Wrapper support => compress.zlib://
Stream Filter support => zlib.inflate, zlib.deflate
Compiled Version => 1.2.3
Linked Version => 1.2.3

Directive => Local Value => Master Value
zlib.output_compression => Off => Off
zlib.output_compression_level => -1 => -1
zlib.output_handler => no value => no value

Additional Modules

Module Name

Environment

Variable => Value
LDFLAGS => -L/usr/local/lib -L/usr/X11R6/lib -L/opt/local/lib
TEST_PHP_SRCDIR => /usr/local/src/php-5.2.1
SHELL => /bin/sh
TERM => xterm-color
MAKEFLAGS =>  
CLICOLOR => YES
CPPFLAGS => -I/usr/local/include -I/usr/X11R6/include -I/opt/local/include -no-cpp-precomp
SSH_CLIENT => deleted
SSH_TTY => deleted
USER => root
SUDO_USER => peter
SUDO_UID => 501
SSH_AUTH_SOCK => deleted
__CF_USER_TEXT_ENCODING => 0x0:0:0
MAKELEVEL => 1
MFLAGS =>  
LSCOLORS => ExGxFxdxCxDxDxBxGxDxDx
PATH => /bin:/sbin:/usr/bin:/usr/sbin:/usr/local/bin:/usr/local/sbin:/usr/local/gtk-X11/bin:/usr/X11R6/bin:/opt/local/bin:/opt/local/sbin:/Library/MySQL/bin
MAIL => /var/mail/peter
_ => /usr/local/src/php-5.2.1/sapi/cli/php
PWD => /usr/local/src/php-5.2.1
TEST_PHP_EXECUTABLE => /usr/local/src/php-5.2.1/sapi/cli/php
SUDO_COMMAND => /bin/bash
HOME => /Users/peter
SHLVL => 4
DESTPATH => /usr/local/ettercap
LOGNAME => root
SSH_CONNECTION => deleted
PKG_CONFIG_PATH => /usr/lib/pkgconfig:/usr/X11R6/lib/pkgconfig:/usr/local/gtk-X11/lib/pkgconfig
SUDO_GID => 501
CC => gcc
LIBTIFF => -L/opt/local/lib:-ltiff
TIFFINC => /opt/local/include
SRCPATH => /usr/local/src/

PHP Variables

Variable => Value
_SERVER["LDFLAGS"] => -L/usr/local/lib -L/usr/X11R6/lib -L/opt/local/lib
_SERVER["TEST_PHP_SRCDIR"] => /usr/local/src/php-5.2.1
_SERVER["SHELL"] => /bin/sh
_SERVER["TERM"] => xterm-color
_SERVER["MAKEFLAGS"] => 
_SERVER["CLICOLOR"] => YES
_SERVER["CPPFLAGS"] => -I/usr/local/include -I/usr/X11R6/include -I/opt/local/include -no-cpp-precomp
_SERVER["SSH_CLIENT"] => deleted
_SERVER["SSH_TTY"] => deleted
_SERVER["USER"] => root
_SERVER["SUDO_USER"] => peter
_SERVER["SUDO_UID"] => 501
_SERVER["SSH_AUTH_SOCK"] => deleted
_SERVER["__CF_USER_TEXT_ENCODING"] => 0x0:0:0
_SERVER["MAKELEVEL"] => 1
_SERVER["MFLAGS"] => 
_SERVER["LSCOLORS"] => ExGxFxdxCxDxDxBxGxDxDx
_SERVER["PATH"] => /bin:/sbin:/usr/bin:/usr/sbin:/usr/local/bin:/usr/local/sbin:/usr/local/gtk-X11/bin:/usr/X11R6/bin:/opt/local/bin:/opt/local/sbin:/Library/MySQL/bin
_SERVER["MAIL"] => /var/mail/peter
_SERVER["_"] => /usr/local/src/php-5.2.1/sapi/cli/php
_SERVER["PWD"] => /usr/local/src/php-5.2.1
_SERVER["TEST_PHP_EXECUTABLE"] => /usr/local/src/php-5.2.1/sapi/cli/php
_SERVER["SUDO_COMMAND"] => /bin/bash
_SERVER["HOME"] => /Users/peter
_SERVER["SHLVL"] => 4
_SERVER["DESTPATH"] => /usr/local/ettercap
_SERVER["LOGNAME"] => root
_SERVER["SSH_CONNECTION"] => deleted
_SERVER["PKG_CONFIG_PATH"] => /usr/lib/pkgconfig:/usr/X11R6/lib/pkgconfig:/usr/local/gtk-X11/lib/pkgconfig
_SERVER["SUDO_GID"] => 501
_SERVER["CC"] => gcc
_SERVER["LIBTIFF"] => -L/opt/local/lib:-ltiff
_SERVER["TIFFINC"] => /opt/local/include
_SERVER["SRCPATH"] => /usr/local/src/
_SERVER["PHP_SELF"] => 
_SERVER["SCRIPT_NAME"] => 
_SERVER["SCRIPT_FILENAME"] => 
_SERVER["PATH_TRANSLATED"] => 
_SERVER["DOCUMENT_ROOT"] => 
_SERVER["REQUEST_TIME"] => 1171040552
_SERVER["argv"] => Array
(
)

_SERVER["argc"] => 0

PHP License
This program is free software; you can redistribute it and/or modify
it under the terms of the PHP License as published by the PHP Group
and included in the distribution in the file:  LICENSE

This program is distributed in the hope that it will be useful,
but WITHOUT ANY WARRANTY; without even the implied warranty of
MERCHANTABILITY or FITNESS FOR A PARTICULAR PURPOSE.

If you did not receive a copy of the PHP license, or have any
questions about PHP licensing, please contact license <at> php.net.

--

-- 
PHP Quality Assurance Mailing List <http://www.php.net/>
To unsubscribe, visit: http://www.php.net/unsub.php

noreply | 9 Feb 19:41 2007
Picon
Picon

Test results for 5.2.1 [failed]


=====================================================================
FAILED TEST SUMMARY
---------------------------------------------------------------------
Test for buffering in core functions with implicit flush off [tests/func/008.phpt]
Bug #39602 (Invalid session.save_handler crashes PHP) [Zend/tests/bug39602.phpt]
Bug #38474 (getAttribute select attribute by order, even when prefixed) (OK to fail with libxml2 < 2.6.2x) [ext/dom/tests/bug38474.phpt]
HTML input/output [ext/mbstring/tests/htmlent.phpt]
mb_output_handler() (Shift_JIS) [ext/mbstring/tests/mb_output_handler_shift_jis.phpt]
SPL: SplObjectStorage serialization [ext/spl/tests/observer_003.phpt]
SPL: SplObjectStorage serialization & overloading [ext/spl/tests/observer_004.phpt]
SPL: SplObjectStorage serialization & visibility [ext/spl/tests/observer_005.phpt]
htmlentities() test 3 (setlocale / de_DE.ISO-8859-1) [ext/standard/tests/strings/htmlentities03.phpt]
htmlentities() test 15 (setlocale / KOI8-R) [ext/standard/tests/strings/htmlentities15.phpt]
=====================================================================

=====================================================================
TEST RESULT SUMMARY
---------------------------------------------------------------------
Exts skipped    :   38
Exts tested     :   41
---------------------------------------------------------------------

Number of tests : 3036              1910
Tests skipped   : 1126 ( 37.1%) --------
Tests warned    :    1 (  0.0%) (  0.1%)
Tests failed    :   10 (  0.3%) (  0.5%)
Tests passed    : 1899 ( 62.5%) ( 99.4%)
---------------------------------------------------------------------
Time taken      :  250 seconds
=====================================================================

=====================================================================
FAILED TEST SUMMARY
---------------------------------------------------------------------
Test for buffering in core functions with implicit flush off [tests/func/008.phpt]
Bug #39602 (Invalid session.save_handler crashes PHP) [Zend/tests/bug39602.phpt]
Bug #38474 (getAttribute select attribute by order, even when prefixed) (OK to fail with libxml2 < 2.6.2x) [ext/dom/tests/bug38474.phpt]
HTML input/output [ext/mbstring/tests/htmlent.phpt]
mb_output_handler() (Shift_JIS) [ext/mbstring/tests/mb_output_handler_shift_jis.phpt]
SPL: SplObjectStorage serialization [ext/spl/tests/observer_003.phpt]
SPL: SplObjectStorage serialization & overloading [ext/spl/tests/observer_004.phpt]
SPL: SplObjectStorage serialization & visibility [ext/spl/tests/observer_005.phpt]
htmlentities() test 3 (setlocale / de_DE.ISO-8859-1) [ext/standard/tests/strings/htmlentities03.phpt]
htmlentities() test 15 (setlocale / KOI8-R) [ext/standard/tests/strings/htmlentities15.phpt]
=====================================================================

================================================================================
/hsphere/local/home/srcweb/INSTALL/PHP/php-5.2.1/tests/func/008.phpt
================================================================================

================================================================================
001- 'foo1'
003- 'foo2'
================================================================================

================================================================================
/hsphere/local/home/srcweb/INSTALL/PHP/php-5.2.1/Zend/tests/bug39602.phpt
================================================================================
ok
================================================================================
002- Fatal error: Unknown: Cannot find save handler qwerty in Unknown on line 0
================================================================================

================================================================================
/hsphere/local/home/srcweb/INSTALL/PHP/php-5.2.1/ext/dom/tests/bug38474.phpt
================================================================================
foo
bar
foo2
bar

baz2
================================================================================
004+ bar
005+ 
006+ 
004- bar2
005- baz
008- baz
================================================================================

================================================================================
/hsphere/local/home/srcweb/INSTALL/PHP/php-5.2.1/ext/mbstring/tests/htmlent.phpt
================================================================================

================================================================================
001+ 
001- HTML-ENTITIES>UTF-8>HTML-ENTITIES
002- Array
003- (
004-     [test] => & <at> AB&#128;&#129;&#130;&auml;&ouml;&uuml;&euro;&lang;&rang;
005- )
006- ===DONE===
================================================================================

================================================================================
/hsphere/local/home/srcweb/INSTALL/PHP/php-5.2.1/ext/mbstring/tests/mb_output_handler_shift_jis.phpt
================================================================================

================================================================================
001+ 
001- string(73) "¥Æ¥¹¥ÈÍÑÆüËܸìʸ»úÎ󡣤³¤Î¥â¥¸¥å¡¼¥ë¤ÏPHP¤Ë¥Þ¥ë¥Á¥Ð¥¤¥È´Ø¿ô¤òÄ󶡤·¤Þ¤¹¡£"
================================================================================

================================================================================
/hsphere/local/home/srcweb/INSTALL/PHP/php-5.2.1/ext/spl/tests/observer_003.phpt
================================================================================
int(4)
int(1)
string(1) "2"
string(3) "foo"
bool(true)
string(28) "O:16:"SplObjectStorage":0:{}"
===UNSERIALIZE===
int(0)
===DONE===
================================================================================
008+ int(0)
008- int(4)
009- int(1)
010- string(1) "2"
011- string(3) "foo"
012- bool(true)
================================================================================

================================================================================
/hsphere/local/home/srcweb/INSTALL/PHP/php-5.2.1/ext/spl/tests/observer_004.phpt
================================================================================
int(2)
int(1)
int(2)
object(MyStorage)#1 (1) {
  ["bla"]=>
  int(26)
}
string(35) "O:9:"MyStorage":1:{s:3:"bla";i:26;}"
===UNSERIALIZE===
int(0)
object(MyStorage)#4 (1) {
  ["bla"]=>
  int(26)
}
===DONE===
================================================================================
010+ int(0)
010- int(2)
011- int(1)
012- int(2)
================================================================================

================================================================================
/hsphere/local/home/srcweb/INSTALL/PHP/php-5.2.1/ext/spl/tests/observer_005.phpt
================================================================================
int(2)
object(TestClass)#2 (4) {
  ["def"]=>
  int(24)
  ["pub"]=>
  int(4)
  ["pro:protected"]=>
  int(5)
  ["pri:private"]=>
  int(6)
}
object(TestClass)#3 (4) {
  ["def"]=>
  int(24)
  ["pub"]=>
  int(7)
  ["pro:protected"]=>
  int(8)
  ["pri:private"]=>
  int(9)
}
object(MyStorage)#1 (4) {
  ["def"]=>
  int(24)
  ["pub"]=>
  int(1)
  ["pro:protected"]=>
  int(2)
  ["pri:private"]=>
  int(3)
}
string(92) "O:9:"MyStorage":4:{s:3:"def";i:24;s:3:"pub";i:1;s:6:"[0x0]*[0x0]pro";i:2;s:14:"[0x0]MyStorage[0x0]pri";i:3;}"
===UNSERIALIZE===
int(0)
object(MyStorage)#4 (4) {
  ["def"]=>
  int(24)
  ["pub"]=>
  int(1)
  ["pro:protected"]=>
  int(2)
  ["pri:private"]=>
  int(3)
}
===DONE===
================================================================================
034+ int(0)
035+ object(MyStorage)#4 (4) {
034- int(2)
035- object(TestClass)#%d (4) {
039+   int(1)
039-   int(4)
041+   int(2)
041-   int(5)
043+   int(3)
043-   int(6)
045+ ===DONE===
045- object(TestClass)#%d (4) {
046-   ["def"]=>
047-   int(24)
048-   ["pub"]=>
049-   int(7)
050-   ["pro:protected"]=>
051-   int(8)
052-   ["pri:private"]=>
053-   int(9)
054- }
055- object(MyStorage)#%d (4) {
056-   ["def"]=>
057-   int(24)
058-   ["pub"]=>
059-   int(1)
060-   ["pro:protected"]=>
061-   int(2)
062-   ["pri:private"]=>
063-   int(3)
064- }
065- ===DONE===
================================================================================

================================================================================
/hsphere/local/home/srcweb/INSTALL/PHP/php-5.2.1/ext/standard/tests/strings/htmlentities03.phpt
================================================================================
string(8) "äö&uuml;"
================================================================================
001+ string(8) "äö&uuml;"
001- string(18) "&auml;&ouml;&uuml;"
================================================================================

================================================================================
/hsphere/local/home/srcweb/INSTALL/PHP/php-5.2.1/ext/standard/tests/strings/htmlentities15.phpt
================================================================================
string(9) "ÒÏÓËÏÛÎÙÊ"
string(15) "ÒÏÓËÏÛÎÙ&Ecirc;"
================================================================================
002+ string(15) "ÒÏÓËÏÛÎÙ&Ecirc;"
002- string(63) "&#1088;&#1086;&#1089;&#1082;&#1086;&#1096;&#1085;&#1099;&#1081;"
================================================================================

================================================================================
BUILD ENVIRONMENT
================================================================================
OS:
Linux - Linux web1.l48.net 2.6.17.6 #2 SMP Sat Oct 21 06:20:58 EDT 2006 i686

Autoconf:
autoconf (GNU Autoconf) 2.59
Written by David J. MacKenzie and Akim Demaille.

Copyright (C) 2003 Free Software Foundation, Inc.
This is free software; see the source for copying conditions.  There is NO
warranty; not even for MERCHANTABILITY or FITNESS FOR A PARTICULAR PURPOSE.

Bundled Libtool:
ltmain.sh (GNU libtool) 1.5.20 (1.1220.2.287 2005/08/31 18:54:15)

Copyright (C) 2005  Free Software Foundation, Inc.
This is free software; see the source for copying conditions.  There is NO
warranty; not even for MERCHANTABILITY or FITNESS FOR A PARTICULAR PURPOSE.

System Libtool:
ltmain.sh (GNU libtool) 1.5.6 (1.1220.2.95 2004/04/11 05:50:42)

Copyright (C) 2003  Free Software Foundation, Inc.
This is free software; see the source for copying conditions.  There is NO
warranty; not even for MERCHANTABILITY or FITNESS FOR A PARTICULAR PURPOSE.

Compiler:
Reading specs from /usr/lib/gcc/i386-redhat-linux/3.4.6/specs
Configured with: ../configure --prefix=/usr --mandir=/usr/share/man --infodir=/usr/share/info
--enable-shared --enable-threads=posix --disable-checking --with-system-zlib
--enable-__cxa_atexit --disable-libunwind-exceptions --enable-java-awt=gtk --host=i386-redhat-linux
Thread model: posix
gcc version 3.4.6 20060404 (Red Hat 3.4.6-3)

Bison:
bison (GNU Bison) 1.875c
Written by Robert Corbett and Richard Stallman.

Copyright (C) 2003 Free Software Foundation, Inc.
This is free software; see the source for copying conditions.  There is NO
warranty; not even for MERCHANTABILITY or FITNESS FOR A PARTICULAR PURPOSE.

Libraries:
	linux-gate.so.1 =>  (0xffffe000)
	libcrypt.so.1 => /lib/libcrypt.so.1 (0x41cca000)
	libdl.so.2 => /lib/libdl.so.2 (0x41c9e000)
	libpspell.so.15 => /usr/local/lib/libpspell.so.15 (0xb7fe6000)
	libaspell.so.15 => /usr/local/lib/libaspell.so.15 (0xb7f2b000)
	libpq.so.3 => /usr/lib/libpq.so.3 (0xb7f10000)
	librt.so.1 => /lib/tls/librt.so.1 (0x41f09000)
	libmhash.so.2 => /usr/local/lib/libmhash.so.2 (0xb7edb000)
	libpam.so.0 => /lib/libpam.so.0 (0x41ec9000)
	libiconv.so.2 => /usr/local/lib/libiconv.so.2 (0xb7e04000)
	libgmp.so.3 => /usr/local/lib/libgmp.so.3 (0xb7dd6000)
	libfreetype.so.6 => /usr/lib/libfreetype.so.6 (0x42036000)
	libpng12.so.0 => /usr/lib/libpng12.so.0 (0x41d39000)
	libjpeg.so.62 => /usr/lib/libjpeg.so.62 (0xb7db7000)
	libssl.so.4 => /lib/libssl.so.4 (0x4b928000)
	libcrypto.so.4 => /lib/libcrypto.so.4 (0x4b83d000)
	libcurl.so.3 => /usr/lib/libcurl.so.3 (0x4b95e000)
	libbz2.so.1 => /usr/lib/libbz2.so.1 (0x41eb7000)
	libresolv.so.2 => /lib/libresolv.so.2 (0x41cfa000)
	libm.so.6 => /lib/tls/libm.so.6 (0x41c79000)
	libnsl.so.1 => /lib/libnsl.so.1 (0x41d14000)
	libgssapi_krb5.so.2 => /usr/lib/libgssapi_krb5.so.2 (0x41ea1000)
	libkrb5.so.3 => /usr/lib/libkrb5.so.3 (0x41e17000)
	libcom_err.so.2 => /lib/libcom_err.so.2 (0x41d0f000)
	libk5crypto.so.3 => /usr/lib/libk5crypto.so.3 (0x41e7e000)
	libidn.so.11 => /usr/lib/libidn.so.11 (0xb7d85000)
	libpthread.so.0 => /lib/tls/libpthread.so.0 (0x41cb6000)
	libxml2.so.2 => /usr/lib/libxml2.so.2 (0xb7c90000)
	libc.so.6 => /lib/tls/libc.so.6 (0x41b4c000)
	/lib/ld-linux.so.2 (0x41b33000)
	libstdc++.so.6 => /usr/lib/libstdc++.so.6 (0xb7bc5000)
	libgcc_s.so.1 => /lib/libgcc_s.so.1 (0xb7bbd000)
	libaudit.so.0 => /lib/libaudit.so.0 (0xb7bac000)
	libz.so.1 => /usr/lib/libz.so.1 (0x41ca4000)

User's E-mail: shadowmaster at shadow-realm dot org

================================================================================
PHPINFO
================================================================================
phpinfo()
PHP Version => 5.2.1

System => Linux web1.l48.net 2.6.17.6 #2 SMP Sat Oct 21 06:20:58 EDT 2006 i686
Build Date => Feb  9 2007 13:18:26
Configure Command =>  './configure' '--localstatedir=/var/hsphere/php'
'--with-apxs=/hsphere/shared/apache/bin/apxs' '--with-openssl=/usr' '--with-zlib=/usr'
'--with-zlib-dir=/usr' '--with-bz2=/usr' '--enable-calendar' '--with-jpeg-dir=/usr'
'--enable-ftp' '--with-gd' '--with-ttf' '--with-freetype-dir=/usr' '--enable-gd-native-ttf'
'--with-png-dir=/usr' '--with-gettext=/usr' '--with-mysql=/usr' '--with-pgsql=/usr'
'--with-curl=/usr' '--with-curlwrappers' '--with-mhash=/usr/local' '--with-iconv=/usr/local'
'--enable-sockets' '--with-zip=/usr' '--enable-track-vars' '--enable-trans-sid'
'--enable-bcmath' '--enable-mbstring' '--disable-debug' '--with-pspell' '--with-gmp'
'--enable-fastcgi' '--enable-discard-path' '--enable-force-redirect' '--with-mysqli'
'--with-config-file-path=/hsphere/local/config/httpd/php5'
'--with-config-file-scan-dir=/hsphere/local/config/httpd/php5/php.d' '--with-pdo
 -mysql' '--with-imap=/usr/local/imap-2006e'
Server API => Command Line Interface
Virtual Directory Support => disabled
Configuration File (php.ini) Path => /hsphere/local/config/httpd/php5/php.ini
Scan this dir for additional .ini files => /hsphere/local/config/httpd/php5/php.d
additional .ini files parsed => /hsphere/local/config/httpd/php5/php.d/eaccelerator.ini

PHP API => 20041225
PHP Extension => 20060613
Zend Extension => 220060519
Debug Build => no
Thread Safety => disabled
Zend Memory Manager => enabled
IPv6 Support => enabled
Registered PHP Streams => php, file, data, ftp, gopher, telnet, dict, ldap, http, https, ftps,
compress.bzip2, compress.zlib  
Registered Stream Socket Transports => tcp, udp, unix, udg, ssl, sslv3, sslv2, tls
Registered Stream Filters => string.rot13, string.toupper, string.tolower, string.strip_tags,
convert.*, consumed, convert.iconv.*, bzip2.*, zlib.*

This program makes use of the Zend Scripting Language Engine:
Zend Engine v2.2.0, Copyright (c) 1998-2007 Zend Technologies

 _______________________________________________________________________

Configuration

PHP Core

Directive => Local Value => Master Value
allow_call_time_pass_reference => On => On
allow_url_fopen => On => On
allow_url_include => Off => Off
always_populate_raw_post_data => On => On
arg_separator.input => & => &
arg_separator.output => & => &
asp_tags => Off => Off
auto_append_file => no value => no value
auto_globals_jit => On => On
auto_prepend_file => no value => no value
browscap => no value => no value
default_charset => iso-8859-1 => iso-8859-1
default_mimetype => text/html => text/html
define_syslog_variables => Off => Off
disable_classes => no value => no value
disable_functions => no value => no value
display_errors => On => On
display_startup_errors => Off => Off
doc_root => no value => no value
docref_ext => no value => no value
docref_root => no value => no value
enable_dl => On => On
error_append_string => no value => no value
error_log => /hsphere/local/var/httpd/logs/php_error.log => /hsphere/local/var/httpd/logs/php_error.log
error_prepend_string => no value => no value
error_reporting => 6135 => 6135
expose_php => On => On
extension_dir => /hsphere/shared/apache/libexec/php5ext/ => /hsphere/shared/apache/libexec/php5ext/
file_uploads => On => On
highlight.bg => <font style="color: #FFFFFF">#FFFFFF</font> => <font style="color: #FFFFFF">#FFFFFF</font>
highlight.comment => <font style="color: #FF9900">#FF9900</font> => <font style="color: #FF9900">#FF9900</font>
highlight.default => <font style="color: #0000BB">#0000BB</font> => <font style="color: #0000BB">#0000BB</font>
highlight.html => <font style="color: #000000">#000000</font> => <font style="color: #000000">#000000</font>
highlight.keyword => <font style="color: #007700">#007700</font> => <font style="color: #007700">#007700</font>
highlight.string => <font style="color: #DD0000">#DD0000</font> => <font style="color: #DD0000">#DD0000</font>
html_errors => Off => Off
ignore_repeated_errors => Off => Off
ignore_repeated_source => Off => Off
ignore_user_abort => Off => Off
implicit_flush => On => On
include_path => .:/hsphere/shared/apache/libexec/php5ext/php/:/usr/local/lib/php/ => .:/hsphere/shared/apache/libexec/php5ext/php/:/usr/local/lib/php/
log_errors => On => On
log_errors_max_len => 1024 => 1024
magic_quotes_gpc => Off => Off
magic_quotes_runtime => Off => Off
magic_quotes_sybase => Off => Off
mail.force_extra_parameters => no value => no value
max_execution_time => 0 => 0
max_input_time => -1 => -1
memory_limit => 32M => 32M
open_basedir => no value => no value
output_buffering => 0 => 0
output_handler => no value => no value
post_max_size => 8M => 8M
precision => 14 => 14
realpath_cache_size => 16K => 16K
realpath_cache_ttl => 120 => 120
register_argc_argv => On => On
register_globals => On => On
register_long_arrays => On => On
report_memleaks => On => On
report_zend_debug => Off => Off
safe_mode => Off => Off
safe_mode_exec_dir => no value => no value
safe_mode_gid => On => On
safe_mode_include_dir => no value => no value
sendmail_from => no value => no value
sendmail_path => /usr/sbin/sendmail -t -i => /usr/sbin/sendmail -t -i
serialize_precision => 100 => 100
short_open_tag => On => On
SMTP => localhost => localhost
smtp_port => 25 => 25
sql.safe_mode => Off => Off
track_errors => Off => Off
unserialize_callback_func => no value => no value
upload_max_filesize => 2M => 2M
upload_tmp_dir => no value => no value
user_dir => no value => no value
variables_order => GPCS => GPCS
xmlrpc_error_number => 0 => 0
xmlrpc_errors => Off => Off
y2k_compliance => On => On
zend.ze1_compatibility_mode => Off => Off

bcmath

BCMath support => enabled

bz2

BZip2 Support => Enabled
Stream Wrapper support => compress.bz2://
Stream Filter support => bzip2.decompress, bzip2.compress
BZip2 Version => 1.0.2, 30-Dec-2001

calendar

Calendar support => enabled

ctype

ctype functions => enabled

curl

cURL support => enabled
cURL Information => libcurl/7.12.1 OpenSSL/0.9.7a zlib/1.2.3 libidn/0.5.6

date

date/time support => enabled
Timezone Database Version => 2006.16
Timezone Database => internal
Default timezone => America/New_York

Directive => Local Value => Master Value
date.default_latitude => 31.7667 => 31.7667
date.default_longitude => 35.2333 => 35.2333
date.sunrise_zenith => 90.583333 => 90.583333
date.sunset_zenith => 90.583333 => 90.583333
date.timezone => no value => no value

dom

DOM/XML => enabled
DOM/XML API Version => 20031129
libxml Version => 2.6.16
HTML Support => enabled
XPath Support => enabled
XPointer Support => enabled
Schema Support => enabled
RelaxNG Support => enabled

filter

Input Validation and Filtering => enabled
Revision => $Revision: 1.52.2.38 $

Directive => Local Value => Master Value
filter.default => unsafe_raw => unsafe_raw
filter.default_flags => no value => no value

ftp

FTP support => enabled

gd

GD Support => enabled
GD Version => bundled (2.0.28 compatible)
FreeType Support => enabled
FreeType Linkage => with freetype
FreeType Version => 2.1.9
GIF Read Support => enabled
GIF Create Support => enabled
JPG Support => enabled
PNG Support => enabled
WBMP Support => enabled
XBM Support => enabled

gettext

GetText Support => enabled

gmp

gmp support => enabled

hash

hash support => enabled
Hashing Engines => md2 md4 md5 sha1 sha256 sha384 sha512 ripemd128 ripemd160 ripemd256 ripemd320
whirlpool tiger128,3 tiger160,3 tiger192,3 tiger128,4 tiger160,4 tiger192,4 snefru gost adler32
crc32 crc32b haval128,3 haval160,3 haval192,3 haval224,3 haval256,3 haval128,4 haval160,4
haval192,4 haval224,4 haval256,4 haval128,5 haval160,5 haval192,5 haval224,5 haval256,5 

iconv

iconv support => enabled
iconv implementation => glibc
iconv library version => 1.9

Directive => Local Value => Master Value
iconv.input_encoding => ISO-8859-1 => ISO-8859-1
iconv.internal_encoding => ISO-8859-1 => ISO-8859-1
iconv.output_encoding => ISO-8859-1 => ISO-8859-1

imap

IMAP c-Client Version => 2004

json

json support => enabled
json version => 1.2.1

libxml

libXML support => active
libXML Version => 2.6.16
libXML streams => enabled

mbstring

Multibyte Support => enabled
Multibyte string engine => libmbfl
Multibyte (japanese) regex support => enabled
Multibyte regex (oniguruma) version => 4.4.4
Multibyte regex (oniguruma) backtrack check => On

mbstring extension makes use of "streamable kanji code filter and converter", which is distributed under
the GNU Lesser General Public License version 2.1.

Directive => Local Value => Master Value
mbstring.detect_order => auto => auto
mbstring.encoding_translation => Off => Off
mbstring.func_overload => 0 => 0
mbstring.http_input => auto => auto
mbstring.http_output => SJIS => SJIS
mbstring.internal_encoding => EUC-JP => EUC-JP
mbstring.language => Japanese => Japanese
mbstring.strict_detection => Off => Off
mbstring.substitute_character => no value => no value

mhash

MHASH support => Enabled
MHASH API Version => 20020524

mysql

MySQL Support => enabled
Active Persistent Links => 0
Active Links => 0
Client API version => 5.0.26
MYSQL_MODULE_TYPE => external
MYSQL_SOCKET => /var/lib/mysql/mysql.sock
MYSQL_INCLUDE => -I/usr/include/mysql
MYSQL_LIBS => -L/usr/lib -lmysqlclient 

Directive => Local Value => Master Value
mysql.allow_persistent => Off => Off
mysql.connect_timeout => 600 => 600
mysql.default_host => localhost => localhost
mysql.default_password => no value => no value
mysql.default_port => 3306 => 3306
mysql.default_socket => /var/lib/mysql/mysql.sock => /var/lib/mysql/mysql.sock
mysql.default_user => no value => no value
mysql.max_links => Unlimited => Unlimited
mysql.max_persistent => Unlimited => Unlimited
mysql.trace_mode => Off => Off

mysqli

MysqlI Support => enabled
Client API library version => 5.0.26
Client API header version => 5.0.26
MYSQLI_SOCKET => /var/lib/mysql/mysql.sock

Directive => Local Value => Master Value
mysqli.default_host => no value => no value
mysqli.default_port => 3306 => 3306
mysqli.default_pw => no value => no value
mysqli.default_socket => no value => no value
mysqli.default_user => no value => no value
mysqli.max_links => Unlimited => Unlimited
mysqli.reconnect => Off => Off

openssl

OpenSSL support => enabled
OpenSSL Version => OpenSSL 0.9.7a Feb 19 2003

pcre

PCRE (Perl Compatible Regular Expressions) Support => enabled
PCRE Library Version => 6.7 04-Jul-2006

PDO

PDO support => enabled
PDO drivers => sqlite2, sqlite, mysql

pdo_mysql

PDO Driver for MySQL, client library version => 5.0.26

pdo_sqlite

PDO Driver for SQLite 3.x => enabled
PECL Module version => (bundled) 1.0.1 $Id: pdo_sqlite.c,v 1.10.2.6.2.1 2007/01/01 09:36:05 sebastian
Exp $
SQLite Library => 3.3.7

pgsql

PostgreSQL Support => enabled
PostgreSQL(libpq) Version => 7.4.16
Multibyte character support => enabled
SSL support => enabled
Active Persistent Links => 0
Active Links => 0

Directive => Local Value => Master Value
pgsql.allow_persistent => Off => Off
pgsql.auto_reset_persistent => Off => Off
pgsql.ignore_notice => Off => Off
pgsql.log_notice => Off => Off
pgsql.max_links => Unlimited => Unlimited
pgsql.max_persistent => Unlimited => Unlimited

posix

Revision => $Revision: 1.70.2.3.2.12 $

pspell

PSpell Support => enabled

Reflection

Reflection => enabled
Version => $Id: php_reflection.c,v 1.164.2.33.2.33 2007/01/01 09:36:05 sebastian Exp $

session

Session Support => enabled
Registered save handlers => files user sqlite 
Registered serializer handlers => php php_binary 

Directive => Local Value => Master Value
session.auto_start => Off => Off
session.bug_compat_42 => Off => Off
session.bug_compat_warn => On => On
session.cache_expire => 180 => 180
session.cache_limiter => nocache => nocache
session.cookie_domain => no value => no value
session.cookie_httponly => Off => Off
session.cookie_lifetime => 0 => 0
session.cookie_path => / => /
session.cookie_secure => Off => Off
session.entropy_file => no value => no value
session.entropy_length => 0 => 0
session.gc_divisor => 1000 => 1000
session.gc_maxlifetime => 1440 => 1440
session.gc_probability => 1 => 1
session.hash_bits_per_character => 5 => 5
session.hash_function => 0 => 0
session.name => PHPSESSID => PHPSESSID
session.referer_check => no value => no value
session.save_handler => files => files
session.save_path => no value => no value
session.serialize_handler => php => php
session.use_cookies => On => On
session.use_only_cookies => Off => Off
session.use_trans_sid => 0 => 0

SimpleXML

Simplexml support => enabled
Revision => $Revision: 1.151.2.22.2.20 $
Schema support => enabled

sockets

Sockets Support => enabled

SPL

SPL support => enabled
Interfaces => Countable, OuterIterator, RecursiveIterator, SeekableIterator, SplObserver, SplSubject
Classes => AppendIterator, ArrayIterator, ArrayObject, BadFunctionCallException,
BadMethodCallException, CachingIterator, DirectoryIterator, DomainException, EmptyIterator,
FilterIterator, InfiniteIterator, InvalidArgumentException, IteratorIterator,
LengthException, LimitIterator, LogicException, NoRewindIterator, OutOfBoundsException,
OutOfRangeException, OverflowException, ParentIterator, RangeException,
RecursiveArrayIterator, RecursiveCachingIterator, RecursiveDirectoryIterator,
RecursiveFilterIterator, RecursiveIteratorIterator, RecursiveRegexIterator, RegexIterator,
RuntimeException, SimpleXMLIterator, SplFileInfo, SplFileObject, SplObjectStorage,
SplTempFileObject, UnderflowException, UnexpectedValueException

SQLite

SQLite support => enabled
PECL Module version => 2.0-dev $Id: sqlite.c,v 1.166.2.13.2.6 2007/01/01 09:36:07 sebastian Exp $
SQLite Library => 2.8.17
SQLite Encoding => iso8859

Directive => Local Value => Master Value
sqlite.assoc_case => 0 => 0

standard

Regex Library => Bundled library enabled
Dynamic Library Support => enabled
Path to sendmail => /usr/sbin/sendmail -t -i

Directive => Local Value => Master Value
assert.active => 1 => 1
assert.bail => no value => no value
assert.callback => 0 => 0
assert.quiet_eval => 0 => 0
assert.warning => 1 => 1
auto_detect_line_endings => 1 => 1
default_socket_timeout => 60 => 60
safe_mode_allowed_env_vars => PHP_ => PHP_
safe_mode_protected_env_vars => LD_LIBRARY_PATH => LD_LIBRARY_PATH
url_rewriter.tags => a=href,area=href,frame=src,input=src,form=fakeentry => a=href,area=href,frame=src,input=src,form=fakeentry
user_agent => no value => no value

tokenizer

Tokenizer Support => enabled

xml

XML Support => active
XML Namespace Support => active
libxml2 Version => 2.6.16

xmlreader

XMLReader => enabled

xmlwriter

XMLWriter => enabled

zlib

ZLib Support => enabled
Stream Wrapper support => compress.zlib://
Stream Filter support => zlib.inflate, zlib.deflate
Compiled Version => 1.2.1.2
Linked Version => 1.2.3

Directive => Local Value => Master Value
zlib.output_compression => Off => Off
zlib.output_compression_level => -1 => -1
zlib.output_handler => no value => no value

Additional Modules

Module Name

Environment

Variable => Value
HOSTNAME => web1.l48.net
TEST_PHP_SRCDIR => /hsphere/local/home/srcweb/INSTALL/PHP/php-5.2.1
SHELL => /bin/sh
TERM => xterm
MAKEFLAGS =>  
HISTSIZE => 1000
SSH_CLIENT => deleted
SSH_TTY => deleted
USER => srcweb
LS_COLORS => no=00:fi=00:di=00;34:ln=00;36:pi=40;33:so=00;35:bd=40;33;01:cd=40;33;01:or=01;05;37;41:mi=01;05;37;41:ex=00;32:*.cmd=00;32:*.exe=00;32:*.com=00;32:*.btm=00;32:*.bat=00;32:*.sh=00;32:*.csh=00;32:*.tar=00;31:*.tgz=00;31:*.arj=00;31:*.taz=00;31:*.lzh=00;31:*.zip=00;31:*.z=00;31:*.Z=00;31:*.gz=00;31:*.bz2=00;31:*.bz=00;31:*.tz=00;31:*.rpm=00;31:*.cpio=00;31:*.jpg=00;35:*.gif=00;35:*.bmp=00;35:*.xbm=00;35:*.xpm=00;35:*.png=00;35:*.tif=00;35:
SSH_AUTH_SOCK => deleted
MAKELEVEL => 1
MFLAGS =>  
PATH => /usr/kerberos/bin:/usr/local/bin:/bin:/usr/bin:/usr/X11R6/bin:/hsphere/local/home/srcweb/bin
MAIL => /var/spool/mail/srcweb
_ => /hsphere/local/home/srcweb/INSTALL/PHP/php-5.2.1/sapi/cli/php
PWD => /hsphere/local/home/srcweb/INSTALL/PHP/php-5.2.1
INPUTRC => /etc/inputrc
EDITOR => /usr/bin/nano
LANG => en_US.UTF-8
TEST_PHP_EXECUTABLE => /hsphere/local/home/srcweb/INSTALL/PHP/php-5.2.1/sapi/cli/php
HOME => /hsphere/local/home/srcweb
SHLVL => 3
LOGNAME => srcweb
SSH_CONNECTION => deleted
LESSOPEN => |/usr/bin/lesspipe.sh %s
CC => gcc
G_BROKEN_FILENAMES => 1

PHP Variables

Variable => Value
PHP_SELF =>  
_SERVER["HOSTNAME"] => web1.l48.net
_SERVER["TEST_PHP_SRCDIR"] => /hsphere/local/home/srcweb/INSTALL/PHP/php-5.2.1
_SERVER["SHELL"] => /bin/sh
_SERVER["TERM"] => xterm
_SERVER["MAKEFLAGS"] => 
_SERVER["HISTSIZE"] => 1000
_SERVER["SSH_CLIENT"] => deleted
_SERVER["SSH_TTY"] => deleted
_SERVER["USER"] => srcweb
_SERVER["LS_COLORS"] => no=00:fi=00:di=00;34:ln=00;36:pi=40;33:so=00;35:bd=40;33;01:cd=40;33;01:or=01;05;37;41:mi=01;05;37;41:ex=00;32:*.cmd=00;32:*.exe=00;32:*.com=00;32:*.btm=00;32:*.bat=00;32:*.sh=00;32:*.csh=00;32:*.tar=00;31:*.tgz=00;31:*.arj=00;31:*.taz=00;31:*.lzh=00;31:*.zip=00;31:*.z=00;31:*.Z=00;31:*.gz=00;31:*.bz2=00;31:*.bz=00;31:*.tz=00;31:*.rpm=00;31:*.cpio=00;31:*.jpg=00;35:*.gif=00;35:*.bmp=00;35:*.xbm=00;35:*.xpm=00;35:*.png=00;35:*.tif=00;35:
_SERVER["SSH_AUTH_SOCK"] => deleted
_SERVER["MAKELEVEL"] => 1
_SERVER["MFLAGS"] => 
_SERVER["PATH"] => /usr/kerberos/bin:/usr/local/bin:/bin:/usr/bin:/usr/X11R6/bin:/hsphere/local/home/srcweb/bin
_SERVER["MAIL"] => /var/spool/mail/srcweb
_SERVER["_"] => /hsphere/local/home/srcweb/INSTALL/PHP/php-5.2.1/sapi/cli/php
_SERVER["PWD"] => /hsphere/local/home/srcweb/INSTALL/PHP/php-5.2.1
_SERVER["INPUTRC"] => /etc/inputrc
_SERVER["EDITOR"] => /usr/bin/nano
_SERVER["LANG"] => en_US.UTF-8
_SERVER["TEST_PHP_EXECUTABLE"] => /hsphere/local/home/srcweb/INSTALL/PHP/php-5.2.1/sapi/cli/php
_SERVER["HOME"] => /hsphere/local/home/srcweb
_SERVER["SHLVL"] => 3
_SERVER["LOGNAME"] => srcweb
_SERVER["SSH_CONNECTION"] => deleted
_SERVER["LESSOPEN"] => |/usr/bin/lesspipe.sh %s
_SERVER["CC"] => gcc
_SERVER["G_BROKEN_FILENAMES"] => 1
_SERVER["PHP_SELF"] => 
_SERVER["SCRIPT_NAME"] => 
_SERVER["SCRIPT_FILENAME"] => 
_SERVER["PATH_TRANSLATED"] => 
_SERVER["DOCUMENT_ROOT"] => 
_SERVER["REQUEST_TIME"] => 1171046496
_SERVER["argv"] => Array
(
)

_SERVER["argc"] => 0

PHP License
This program is free software; you can redistribute it and/or modify
it under the terms of the PHP License as published by the PHP Group
and included in the distribution in the file:  LICENSE

This program is distributed in the hope that it will be useful,
but WITHOUT ANY WARRANTY; without even the implied warranty of
MERCHANTABILITY or FITNESS FOR A PARTICULAR PURPOSE.

If you did not receive a copy of the PHP license, or have any
questions about PHP licensing, please contact license <at> php.net.

--

-- 
PHP Quality Assurance Mailing List <http://www.php.net/>
To unsubscribe, visit: http://www.php.net/unsub.php

noreply | 9 Feb 21:16 2007
Picon
Picon

Test results for 5.2.1 [failed]


=====================================================================
FAILED TEST SUMMARY
---------------------------------------------------------------------
Test for buffering in core functions with implicit flush off [tests/func/008.phpt]
Bug #30638 (localeconv returns wrong LC_NUMERIC settings) [tests/lang/bug30638.phpt]
Bug #39602 (Invalid session.save_handler crashes PHP) [Zend/tests/bug39602.phpt]
Bug #38474 (getAttribute select attribute by order, even when prefixed) (OK to fail with libxml2 < 2.6.2x) [ext/dom/tests/bug38474.phpt]
imagecopy doen't copy alpha, palette to truecolor [ext/gd/tests/bug38179.phpt]
imagefill() infinite loop with wrong color index [ext/gd/tests/imagefill_1.phpt]
HTML input/output [ext/mbstring/tests/htmlent.phpt]
mb_output_handler() (Shift_JIS) [ext/mbstring/tests/mb_output_handler_shift_jis.phpt]
SPL: SplObjectStorage serialization [ext/spl/tests/observer_003.phpt]
SPL: SplObjectStorage serialization & overloading [ext/spl/tests/observer_004.phpt]
SPL: SplObjectStorage serialization & visibility [ext/spl/tests/observer_005.phpt]
Sort with SORT_LOCALE_STRING [ext/standard/tests/array/locale_sort.phpt]
inet_ntop() & inet_pton() tests [ext/standard/tests/network/inet.phpt]
htmlentities() test 4 (setlocale / ja_JP.EUC-JP) [ext/standard/tests/strings/htmlentities04.phpt]
htmlentities() test 15 (setlocale / KOI8-R) [ext/standard/tests/strings/htmlentities15.phpt]
Generic pack()/unpack() tests [ext/standard/tests/strings/pack.phpt]
shm_attach() tests [ext/sysvshm/tests/002.phpt]
shm_remove() tests [ext/sysvshm/tests/007.phpt]
=====================================================================

=====================================================================
TEST RESULT SUMMARY
---------------------------------------------------------------------
Exts skipped    :   39
Exts tested     :   40
---------------------------------------------------------------------

Number of tests : 3036              2289
Tests skipped   :  747 ( 24.6%) --------
Tests warned    :    1 (  0.0%) (  0.0%)
Tests failed    :   18 (  0.6%) (  0.8%)
Tests passed    : 2270 ( 74.8%) ( 99.2%)
---------------------------------------------------------------------
Time taken      :  293 seconds
=====================================================================

=====================================================================
FAILED TEST SUMMARY
---------------------------------------------------------------------
Test for buffering in core functions with implicit flush off [tests/func/008.phpt]
Bug #30638 (localeconv returns wrong LC_NUMERIC settings) [tests/lang/bug30638.phpt]
Bug #39602 (Invalid session.save_handler crashes PHP) [Zend/tests/bug39602.phpt]
Bug #38474 (getAttribute select attribute by order, even when prefixed) (OK to fail with libxml2 < 2.6.2x) [ext/dom/tests/bug38474.phpt]
imagecopy doen't copy alpha, palette to truecolor [ext/gd/tests/bug38179.phpt]
imagefill() infinite loop with wrong color index [ext/gd/tests/imagefill_1.phpt]
HTML input/output [ext/mbstring/tests/htmlent.phpt]
mb_output_handler() (Shift_JIS) [ext/mbstring/tests/mb_output_handler_shift_jis.phpt]
SPL: SplObjectStorage serialization [ext/spl/tests/observer_003.phpt]
SPL: SplObjectStorage serialization & overloading [ext/spl/tests/observer_004.phpt]
SPL: SplObjectStorage serialization & visibility [ext/spl/tests/observer_005.phpt]
Sort with SORT_LOCALE_STRING [ext/standard/tests/array/locale_sort.phpt]
inet_ntop() & inet_pton() tests [ext/standard/tests/network/inet.phpt]
htmlentities() test 4 (setlocale / ja_JP.EUC-JP) [ext/standard/tests/strings/htmlentities04.phpt]
htmlentities() test 15 (setlocale / KOI8-R) [ext/standard/tests/strings/htmlentities15.phpt]
Generic pack()/unpack() tests [ext/standard/tests/strings/pack.phpt]
shm_attach() tests [ext/sysvshm/tests/002.phpt]
shm_remove() tests [ext/sysvshm/tests/007.phpt]
=====================================================================

================================================================================
/Users/cah/src/php-5.2.1/tests/func/008.phpt
================================================================================

================================================================================
001- 'foo1'
003- 'foo2'
================================================================================

================================================================================
/Users/cah/src/php-5.2.1/tests/lang/bug30638.phpt
================================================================================
decimal_point: ,
thousands_sep:
================================================================================
002+ thousands_sep:
002- thousands_sep: .
================================================================================

================================================================================
/Users/cah/src/php-5.2.1/Zend/tests/bug39602.phpt
================================================================================
ok
================================================================================
002- Fatal error: Unknown: Cannot find save handler qwerty in Unknown on line 0
================================================================================

================================================================================
/Users/cah/src/php-5.2.1/ext/dom/tests/bug38474.phpt
================================================================================
foo
bar
foo2
bar

baz2
================================================================================
004+ bar
005+ 
006+ 
004- bar2
005- baz
008- baz
================================================================================

================================================================================
/Users/cah/src/php-5.2.1/ext/gd/tests/bug38179.phpt
================================================================================
FF0000
================================================================================
001+ FF0000
001- 46FF0000
================================================================================

================================================================================
/Users/cah/src/php-5.2.1/ext/gd/tests/imagefill_1.phpt
================================================================================
03
================================================================================
001+ 03
001- 00
================================================================================

================================================================================
/Users/cah/src/php-5.2.1/ext/mbstring/tests/htmlent.phpt
================================================================================

================================================================================
001+ 
001- HTML-ENTITIES>UTF-8>HTML-ENTITIES
002- Array
003- (
004-     [test] => & <at> AB&#128;&#129;&#130;&auml;&ouml;&uuml;&euro;&lang;&rang;
005- )
006- ===DONE===
================================================================================

================================================================================
/Users/cah/src/php-5.2.1/ext/mbstring/tests/mb_output_handler_shift_jis.phpt
================================================================================

================================================================================
001+ 
001- string(73) "¥Æ¥¹¥ÈÍÑÆüËܸìʸ»úÎ󡣤³¤Î¥â¥¸¥å¡¼¥ë¤ÏPHP¤Ë¥Þ¥ë¥Á¥Ð¥¤¥È´Ø¿ô¤òÄ󶡤·¤Þ¤¹¡£"
================================================================================

================================================================================
/Users/cah/src/php-5.2.1/ext/spl/tests/observer_003.phpt
================================================================================
int(4)
int(1)
string(1) "2"
string(3) "foo"
bool(true)
string(28) "O:16:"SplObjectStorage":0:{}"
===UNSERIALIZE===
int(0)
===DONE===
================================================================================
008+ int(0)
008- int(4)
009- int(1)
010- string(1) "2"
011- string(3) "foo"
012- bool(true)
================================================================================

================================================================================
/Users/cah/src/php-5.2.1/ext/spl/tests/observer_004.phpt
================================================================================
int(2)
int(1)
int(2)
object(MyStorage)#1 (1) {
  ["bla"]=>
  int(26)
}
string(35) "O:9:"MyStorage":1:{s:3:"bla";i:26;}"
===UNSERIALIZE===
int(0)
object(MyStorage)#4 (1) {
  ["bla"]=>
  int(26)
}
===DONE===
================================================================================
010+ int(0)
010- int(2)
011- int(1)
012- int(2)
================================================================================

================================================================================
/Users/cah/src/php-5.2.1/ext/spl/tests/observer_005.phpt
================================================================================
int(2)
object(TestClass)#2 (4) {
  ["def"]=>
  int(24)
  ["pub"]=>
  int(4)
  ["pro:protected"]=>
  int(5)
  ["pri:private"]=>
  int(6)
}
object(TestClass)#3 (4) {
  ["def"]=>
  int(24)
  ["pub"]=>
  int(7)
  ["pro:protected"]=>
  int(8)
  ["pri:private"]=>
  int(9)
}
object(MyStorage)#1 (4) {
  ["def"]=>
  int(24)
  ["pub"]=>
  int(1)
  ["pro:protected"]=>
  int(2)
  ["pri:private"]=>
  int(3)
}
string(92) "O:9:"MyStorage":4:{s:3:"def";i:24;s:3:"pub";i:1;s:6:"[0x0]*[0x0]pro";i:2;s:14:"[0x0]MyStorage[0x0]pri";i:3;}"
===UNSERIALIZE===
int(0)
object(MyStorage)#4 (4) {
  ["def"]=>
  int(24)
  ["pub"]=>
  int(1)
  ["pro:protected"]=>
  int(2)
  ["pri:private"]=>
  int(3)
}
===DONE===
================================================================================
034+ int(0)
035+ object(MyStorage)#4 (4) {
034- int(2)
035- object(TestClass)#%d (4) {
039+   int(1)
039-   int(4)
041+   int(2)
041-   int(5)
043+   int(3)
043-   int(6)
045+ ===DONE===
045- object(TestClass)#%d (4) {
046-   ["def"]=>
047-   int(24)
048-   ["pub"]=>
049-   int(7)
050-   ["pro:protected"]=>
051-   int(8)
052-   ["pri:private"]=>
053-   int(9)
054- }
055- object(MyStorage)#%d (4) {
056-   ["def"]=>
057-   int(24)
058-   ["pub"]=>
059-   int(1)
060-   ["pro:protected"]=>
061-   int(2)
062-   ["pri:private"]=>
063-   int(3)
064- }
065- ===DONE===
================================================================================

================================================================================
/Users/cah/src/php-5.2.1/ext/standard/tests/array/locale_sort.phpt
================================================================================
array(13) {
  ["AB"]=>
  string(7) "Alberta"
  ["BC"]=>
  string(20) "Colombie-Britannique"
  ["MB"]=>
  string(8) "Manitoba"
  ["NB"]=>
  string(17) "Nouveau-Brunswick"
  ["NS"]=>
  string(15) "Nouvelle-Écosse"
  ["NU"]=>
  string(7) "Nunavut"
  ["ON"]=>
  string(7) "Ontario"
  ["QC"]=>
  string(6) "Québec"
  ["SK"]=>
  string(12) "Saskatchewan"
  ["NL"]=>
  string(23) "Terre-Neuve-et-Labrador"
  ["YT"]=>
  string(19) "Territoire du Yukon"
  ["NT"]=>
  string(25) "Territoires du Nord-Ouest"
  ["PE"]=>
  string(21) "Île-du-Prince-Édouard"
}
================================================================================
006-   ["PE"]=>
007-   string(21) "Île-du-Prince-Édouard"
026+   ["PE"]=>
027+   string(21) "Île-du-Prince-Édouard"
================================================================================

================================================================================
/Users/cah/src/php-5.2.1/ext/standard/tests/network/inet.phpt
================================================================================
string(9) "127.0.0.1"
string(13) "255.255.255.0"
string(10) "::0.0.0.38"

Warning: inet_ntop() expects exactly 1 parameter, 0 given in
/Users/cah/src/php-5.2.1/ext/standard/tests/network/inet.php on line 12
bool(false)

Warning: inet_ntop(): Invalid in_addr value in
/Users/cah/src/php-5.2.1/ext/standard/tests/network/inet.php on line 13
bool(false)

Warning: inet_ntop(): Invalid in_addr value in
/Users/cah/src/php-5.2.1/ext/standard/tests/network/inet.php on line 14
bool(false)

Warning: inet_ntop(): Invalid in_addr value in
/Users/cah/src/php-5.2.1/ext/standard/tests/network/inet.php on line 15
bool(false)

Warning: inet_pton() expects exactly 1 parameter, 0 given in
/Users/cah/src/php-5.2.1/ext/standard/tests/network/inet.php on line 17
bool(false)

Warning: inet_pton(): Unrecognized address  in
/Users/cah/src/php-5.2.1/ext/standard/tests/network/inet.php on line 18
bool(false)

Warning: inet_pton(): Unrecognized address -1 in
/Users/cah/src/php-5.2.1/ext/standard/tests/network/inet.php on line 19
bool(false)

Warning: inet_pton(): Unrecognized address abra in
/Users/cah/src/php-5.2.1/ext/standard/tests/network/inet.php on line 20
bool(false)
string(4) "[0x0][0x0]"
string(9) "127.0.0.1"
string(4) "B£¡t"
string(14) "66.163.161.116"
string(4) "ÿÿÿÿ"
string(15) "255.255.255.255"
string(4) "[0x0][0x0][0x0][0x0]"
string(7) "0.0.0.0"
Done
================================================================================
003+ string(10) "::0.0.0.38"
003- string(4) "::26"
================================================================================

================================================================================
/Users/cah/src/php-5.2.1/ext/standard/tests/strings/htmlentities04.phpt
================================================================================
string(42) "&iexcl;&cent;&iexcl;&pound;&iexcl;&curren;"
================================================================================
001+ string(42) "&iexcl;&cent;&iexcl;&pound;&iexcl;&curren;"
001- string(6) "¡¢¡£¡¤"
================================================================================

================================================================================
/Users/cah/src/php-5.2.1/ext/standard/tests/strings/htmlentities15.phpt
================================================================================
string(9) "ÒÏÓËÏÛÎÙÊ"
string(63) "&Ograve;&Iuml;&Oacute;&Euml;&Iuml;&Ucirc;&Icirc;&Ugrave;&Ecirc;"
================================================================================
002+ string(63) "&Ograve;&Iuml;&Oacute;&Euml;&Iuml;&Ucirc;&Icirc;&Ugrave;&Ecirc;"
002- string(63) "&#1088;&#1086;&#1089;&#1082;&#1086;&#1096;&#1085;&#1099;&#1081;"
================================================================================

================================================================================
/Users/cah/src/php-5.2.1/ext/standard/tests/strings/pack.phpt
================================================================================
Array
(
    [1] => h
)
Array
(
    [1] => hello world
)
"hello    "
Array
(
    [1] => 129
)
Array
(
    [1] => 127
)
Array
(
    [1] => 255
)
Array
(
    [1] => 127
)
Array
(
    [1] => 4
)
Array
(
    [1] => 65534
)
Array
(
    [1] => 0
)
Array
(
    [1] => -1000
)
Array
(
    [1] => -64434
)
Array
(
    [1] => -1
)
Array
(
    [1] => -2147483648
)
Array
(
    [1] => 65534
)
Array
(
    [1] => 0
)
Array
(
    [1] => -2147483646
)
Array
(
    [1] => -1
)
Array
(
    [1] => -2147483648
)
Array
(
    [1] => 65534
)
Array
(
    [1] => 0
)
Array
(
    [1] => -2147483646
)
Array
(
    [1] => -1
)
Array
(
    [1] => -2147483648
)
Array
(
    [1] => -30000
)
Array
(
    [1] => 65534
)
Array
(
    [1] => 1
)
Array
(
    [1] => 0
)
Array
(
    [1] => 64536
)
Array
(
    [1] => 1102
)
Array
(
    [1] => 1
)
Array
(
    [1] => 65534
)
Array
(
    [1] => 0
)
Array
(
    [1] => -2147483646
)
Array
(
    [1] => -1
)
Array
(
    [1] => -2147483648
)
Array
(
    [1] => h
)
Array
(
    [1] => hello world
)
Array
(
    [1] => -127
)
Array
(
    [1] => 127
)
Array
(
    [1] => -1
)
Array
(
    [1] => 127
)
Array
(
    [1] => 3
)
Array
(
    [1] => 65534
)
Array
(
    [1] => 0
)
Array
(
    [1] => -1000
)
Array
(
    [1] => -64434
)
Array
(
    [1] => -65535
)
Array
(
    [1] => -2147483647
)
Array
(
    [1] => 65534
)
Array
(
    [1] => 0
)
Array
(
    [1] => -2147483646
)
Array
(
    [1] => -1
)
Array
(
    [1] => -2147483648
)
Array
(
    [1] => 65534
)
Array
(
    [1] => 1
)
Array
(
    [1] => 0
)
Array
(
    [1] => 64536
)
Array
(
    [1] => 1102
)
Array
(
    [1] => 1
)
Array
(
    [1] => 32767
)
Array
(
    [1] => -1
)
Array
(
    [1] => 0
)
Array
(
    [1] => -1000
)
Array
(
    [1] => 1102
)
Array
(
    [1] => 1
)
Array
(
    [1] => 65534
)
Array
(
    [1] => 1
)
Array
(
    [1] => 0
)
Array
(
    [1] => 64536
)
Array
(
    [1] => 1102
)
Array
(
    [1] => 1
)
================================================================================
048+     [1] => -1
048-     [1] => 0
088+     [1] => -1
088-     [1] => 0
136+     [1] => -1
136-     [1] => 0
208+     [1] => -1
208-     [1] => 0
================================================================================

================================================================================
/Users/cah/src/php-5.2.1/ext/sysvshm/tests/002.phpt
================================================================================
Warning: Wrong parameter count for shm_attach() in
/Users/cah/src/php-5.2.1/ext/sysvshm/tests/002.php on line 5
NULL

Warning: Wrong parameter count for shm_attach() in
/Users/cah/src/php-5.2.1/ext/sysvshm/tests/002.php on line 6
NULL

Warning: shm_attach(): failed for key 0xffffffff: memorysize too small in
/Users/cah/src/php-5.2.1/ext/sysvshm/tests/002.php on line 8
bool(false)

Warning: shm_attach(): failed for key 0x0: Invalid argument in
/Users/cah/src/php-5.2.1/ext/sysvshm/tests/002.php on line 9
bool(false)

Warning: shm_attach(): failed for key 0x7b: Invalid argument in
/Users/cah/src/php-5.2.1/ext/sysvshm/tests/002.php on line 10
bool(false)

Warning: shm_attach(): failed for key 0x7402cd3e: Invalid argument in
/Users/cah/src/php-5.2.1/ext/sysvshm/tests/002.php on line 11
bool(false)

Warning: shm_remove(): The parameter is not a valid shm_identifier in
/Users/cah/src/php-5.2.1/ext/sysvshm/tests/002.php on line 12

Warning: shm_attach(): failed for key 0x7402cd3e: memorysize too small in
/Users/cah/src/php-5.2.1/ext/sysvshm/tests/002.php on line 13
bool(false)

Warning: shm_remove(): The parameter is not a valid shm_identifier in
/Users/cah/src/php-5.2.1/ext/sysvshm/tests/002.php on line 14
int(4)

Warning: shm_remove(): The parameter is not a valid shm_identifier in
/Users/cah/src/php-5.2.1/ext/sysvshm/tests/002.php on line 17
int(5)
int(6)

Warning: shm_remove(): failed for key 0x7402cd3e, id 5: Invalid argument in
/Users/cah/src/php-5.2.1/ext/sysvshm/tests/002.php on line 21
int(7)
int(8)
Done
================================================================================
030+ 
031+ Warning: shm_remove(): failed for key 0x7402cd3e, id 5: Invalid argument in
/Users/cah/src/php-5.2.1/ext/sysvshm/tests/002.php on line 21
================================================================================

================================================================================
/Users/cah/src/php-5.2.1/ext/sysvshm/tests/007.phpt
================================================================================
Warning: Wrong parameter count for shm_remove() in
/Users/cah/src/php-5.2.1/ext/sysvshm/tests/007.php on line 6
NULL

Warning: shm_remove(): The parameter is not a valid shm_identifier in
/Users/cah/src/php-5.2.1/ext/sysvshm/tests/007.php on line 7
bool(false)

Warning: shm_remove(): The parameter is not a valid shm_identifier in
/Users/cah/src/php-5.2.1/ext/sysvshm/tests/007.php on line 8
bool(false)

Warning: shm_remove(): The parameter is not a valid shm_identifier in
/Users/cah/src/php-5.2.1/ext/sysvshm/tests/007.php on line 9
bool(false)
bool(true)

Warning: shm_remove(): failed for key 0x7402cd4c, id 4: Invalid argument in
/Users/cah/src/php-5.2.1/ext/sysvshm/tests/007.php on line 12
bool(false)

Warning: shm_remove(): The parameter is not a valid shm_identifier in
/Users/cah/src/php-5.2.1/ext/sysvshm/tests/007.php on line 15
bool(false)
Done
================================================================================
013+ 
014+ Warning: shm_remove(): failed for key 0x7402cd4c, id 4: Invalid argument in
/Users/cah/src/php-5.2.1/ext/sysvshm/tests/007.php on line 12
015+ bool(false)
013- bool(true)
================================================================================

================================================================================
BUILD ENVIRONMENT
================================================================================
OS:
Darwin - Darwin supernova.esm.psu.edu 8.8.0 Darwin Kernel Version 8.8.0: Fri Sep  8 17:18:57 PDT 2006;
root:xnu-792.12.6.obj~1/RELEASE_PPC Power Macintosh

Autoconf:
autoconf (GNU Autoconf) 2.59
Written by David J. MacKenzie and Akim Demaille.

Copyright (C) 2003 Free Software Foundation, Inc.
This is free software; see the source for copying conditions.  There is NO
warranty; not even for MERCHANTABILITY or FITNESS FOR A PARTICULAR PURPOSE.

Bundled Libtool:
ltmain.sh (GNU libtool) 1.5.20 (1.1220.2.287 2005/08/31 18:54:15)

Copyright (C) 2005  Free Software Foundation, Inc.
This is free software; see the source for copying conditions.  There is NO
warranty; not even for MERCHANTABILITY or FITNESS FOR A PARTICULAR PURPOSE.

System Libtool:
ltmain.sh (GNU libtool) 1.5 (1.1220 2003/04/05 19:32:58)

Copyright (C) 2003  Free Software Foundation, Inc.
This is free software; see the source for copying conditions.  There is NO
warranty; not even for MERCHANTABILITY or FITNESS FOR A PARTICULAR PURPOSE.

Compiler:
Using built-in specs.
Target: powerpc-apple-darwin8
Configured with: /private/var/tmp/gcc/gcc-5341.obj~1/src/configure --disable-checking
-enable-werror --prefix=/usr --mandir=/share/man --enable-languages=c,objc,c++,obj-c++
--program-transform-name=/^[cg][^.-]*$/s/$/-4.0/ --with-gxx-include-dir=/include/c++/4.0.0
--with-slibdir=/usr/lib --build=powerpc-apple-darwin8 --host=powerpc-apple-darwin8 --target=powerpc-apple-darwin8
Thread model: posix
gcc version 4.0.1 (Apple Computer, Inc. build 5341)

Bison:
GNU Bison version 1.28

Libraries:

User's E-mail: cah190 at psu dot edu

================================================================================
PHPINFO
================================================================================
phpinfo()
PHP Version => 5.2.1

System => Darwin supernova.esm.psu.edu 8.8.0 Darwin Kernel Version 8.8.0: Fri Sep  8 17:18:57 PDT 2006;
root:xnu-792.12.6.obj~1/RELEASE_PPC Power Macintosh
Build Date => Feb  9 2007 15:05:27
Configure Command =>  './configure' '--prefix=/usr' '--mandir=/usr/share/man'
'--infodir=/usr/share/info' '--with-apxs' '--with-ldap=/usr' '--with-kerberos=/usr'
'--enable-cli' '--with-zlib-dir=/usr' '--enable-trans-sid' '--with-xml' '--enable-exif'
'--enable-ftp' '--enable-mbstring' '--enable-mbregex' '--enable-dbx' '--enable-sockets'
'--with-iodbc=/usr' '--with-config-file-path=/etc' '--sysconfdir=/private/etc'
'--with-mysql=/usr' '--with-mssql=/usr/local' '--with-gd=/sw' '--with-curl'
'--with-mysqli=/usr/bin/mysql_config' '--with-pdo-mysql' '--enable-sysvsem'
'--enable-sysvmsg' '--enable-sysvshm' '--with-jpeg-dir=/sw' '--with-png-dir=/sw'
'--with-xpm-dir=/usr/X11R6' '--with-freetype-dir=/usr/X11R6' '--enable-soap' '--with-openssl=/usr'
Server API => Command Line Interface
Virtual Directory Support => disabled
Configuration File (php.ini) Path => /private/etc/php.ini
PHP API => 20041225
PHP Extension => 20060613
Zend Extension => 220060519
Debug Build => no
Thread Safety => disabled
Zend Memory Manager => enabled
IPv6 Support => enabled
Registered PHP Streams => php, file, data, http, ftp, compress.zlib, https, ftps  
Registered Stream Socket Transports => tcp, udp, unix, udg, ssl, sslv3, sslv2, tls
Registered Stream Filters => string.rot13, string.toupper, string.tolower, string.strip_tags,
convert.*, consumed, convert.iconv.*, zlib.*

This program makes use of the Zend Scripting Language Engine:
Zend Engine v2.2.0, Copyright (c) 1998-2007 Zend Technologies

 _______________________________________________________________________

Configuration

PHP Core

Directive => Local Value => Master Value
allow_call_time_pass_reference => On => On
allow_url_fopen => On => On
allow_url_include => Off => Off
always_populate_raw_post_data => Off => Off
arg_separator.input => & => &
arg_separator.output => & => &
asp_tags => Off => Off
auto_append_file => no value => no value
auto_globals_jit => On => On
auto_prepend_file => no value => no value
browscap => no value => no value
default_charset => no value => no value
default_mimetype => text/html => text/html
define_syslog_variables => Off => Off
disable_classes => no value => no value
disable_functions => no value => no value
display_errors => On => On
display_startup_errors => Off => Off
doc_root => no value => no value
docref_ext => no value => no value
docref_root => no value => no value
enable_dl => On => On
error_append_string => no value => no value
error_log => no value => no value
error_prepend_string => no value => no value
error_reporting => 6135 => 6135
expose_php => On => On
extension_dir => ./ => ./
file_uploads => On => On
highlight.bg => <font style="color: #FFFFFF">#FFFFFF</font> => <font style="color: #FFFFFF">#FFFFFF</font>
highlight.comment => <font style="color: #FF8000">#FF8000</font> => <font style="color: #FF8000">#FF8000</font>
highlight.default => <font style="color: #0000BB">#0000BB</font> => <font style="color: #0000BB">#0000BB</font>
highlight.html => <font style="color: #000000">#000000</font> => <font style="color: #000000">#000000</font>
highlight.keyword => <font style="color: #007700">#007700</font> => <font style="color: #007700">#007700</font>
highlight.string => <font style="color: #DD0000">#DD0000</font> => <font style="color: #DD0000">#DD0000</font>
html_errors => Off => Off
ignore_repeated_errors => Off => Off
ignore_repeated_source => Off => Off
ignore_user_abort => Off => Off
implicit_flush => On => On
include_path => .:/usr/lib/php:/usr/local/lib/php => .:/usr/lib/php:/usr/local/lib/php
log_errors => Off => Off
log_errors_max_len => 1024 => 1024
magic_quotes_gpc => On => On
magic_quotes_runtime => Off => Off
magic_quotes_sybase => Off => Off
mail.force_extra_parameters => no value => no value
max_execution_time => 0 => 0
max_input_time => -1 => -1
memory_limit => 10M => 10M
open_basedir => no value => no value
output_buffering => 0 => 0
output_handler => no value => no value
post_max_size => 8M => 8M
precision => 12 => 12
realpath_cache_size => 16K => 16K
realpath_cache_ttl => 120 => 120
register_argc_argv => On => On
register_globals => Off => Off
register_long_arrays => On => On
report_memleaks => On => On
report_zend_debug => Off => Off
safe_mode => Off => Off
safe_mode_exec_dir => no value => no value
safe_mode_gid => Off => Off
safe_mode_include_dir => no value => no value
sendmail_from => no value => no value
sendmail_path => /usr/sbin/sendmail -t -i  => /usr/sbin/sendmail -t -i 
serialize_precision => 100 => 100
short_open_tag => On => On
SMTP => localhost => localhost
smtp_port => 25 => 25
sql.safe_mode => Off => Off
track_errors => Off => Off
unserialize_callback_func => no value => no value
upload_max_filesize => 64M => 64M
upload_tmp_dir => no value => no value
user_dir => no value => no value
variables_order => EGPCS => EGPCS
xmlrpc_error_number => 0 => 0
xmlrpc_errors => Off => Off
y2k_compliance => On => On
zend.ze1_compatibility_mode => Off => Off

ctype

ctype functions => enabled

curl

cURL support => enabled
cURL Information => libcurl/7.13.1 OpenSSL/0.9.7l zlib/1.2.3

date

date/time support => enabled
Timezone Database Version => 2006.16
Timezone Database => internal
Default timezone => America/New_York

Directive => Local Value => Master Value
date.default_latitude => 31.7667 => 31.7667
date.default_longitude => 35.2333 => 35.2333
date.sunrise_zenith => 90.583333 => 90.583333
date.sunset_zenith => 90.583333 => 90.583333
date.timezone => no value => no value

dom

DOM/XML => enabled
DOM/XML API Version => 20031129
libxml Version => 2.6.16
HTML Support => enabled
XPath Support => enabled
XPointer Support => enabled
Schema Support => enabled
RelaxNG Support => enabled

exif

EXIF Support => enabled
EXIF Version => 1.4 $Id: exif.c,v 1.173.2.5.2.11 2007/01/23 00:23:17 iliaa Exp $
Supported EXIF Version => 0220
Supported filetypes => JPEG,TIFF

filter

Input Validation and Filtering => enabled
Revision => $Revision: 1.52.2.38 $

Directive => Local Value => Master Value
filter.default => unsafe_raw => unsafe_raw
filter.default_flags => no value => no value

ftp

FTP support => enabled

gd

GD Support => enabled
GD Version => 2.0 or higher
FreeType Support => enabled
FreeType Linkage => with freetype
FreeType Version => 2.1.4
GIF Read Support => enabled
GIF Create Support => enabled
JPG Support => enabled
PNG Support => enabled
WBMP Support => enabled

hash

hash support => enabled
Hashing Engines => md2 md4 md5 sha1 sha256 sha384 sha512 ripemd128 ripemd160 ripemd256 ripemd320
whirlpool tiger128,3 tiger160,3 tiger192,3 tiger128,4 tiger160,4 tiger192,4 snefru gost adler32
crc32 crc32b haval128,3 haval160,3 haval192,3 haval224,3 haval256,3 haval128,4 haval160,4
haval192,4 haval224,4 haval256,4 haval128,5 haval160,5 haval192,5 haval224,5 haval256,5 

iconv

iconv support => enabled
iconv implementation => libiconv
iconv library version => 1.10

Directive => Local Value => Master Value
iconv.input_encoding => ISO-8859-1 => ISO-8859-1
iconv.internal_encoding => ISO-8859-1 => ISO-8859-1
iconv.output_encoding => ISO-8859-1 => ISO-8859-1

json

json support => enabled
json version => 1.2.1

ldap

LDAP Support => enabled
RCS Version => $Id: ldap.c,v 1.161.2.3.2.3 2007/01/05 15:06:55 iliaa Exp $
Total Links => 0/unlimited
API Version => 3001
Vendor Name => OpenLDAP
Vendor Version => 20219

libxml

libXML support => active
libXML Version => 2.6.16
libXML streams => enabled

mbstring

Multibyte Support => enabled
Multibyte string engine => libmbfl
Multibyte (japanese) regex support => enabled
Multibyte regex (oniguruma) version => 4.4.4
Multibyte regex (oniguruma) backtrack check => On

mbstring extension makes use of "streamable kanji code filter and converter", which is distributed under
the GNU Lesser General Public License version 2.1.

Directive => Local Value => Master Value
mbstring.detect_order => no value => no value
mbstring.encoding_translation => Off => Off
mbstring.func_overload => 0 => 0
mbstring.http_input => pass => pass
mbstring.http_output => pass => pass
mbstring.internal_encoding => ISO-8859-1 => no value
mbstring.language => neutral => neutral
mbstring.strict_detection => Off => Off
mbstring.substitute_character => no value => no value

mssql

MSSQL Support => enabled
Active Persistent Links => 0
Active Links => 0
Library version => FreeTDS

Directive => Local Value => Master Value
mssql.allow_persistent => On => On
mssql.batchsize => 0 => 0
mssql.charset => no value => no value
mssql.compatability_mode => Off => Off
mssql.connect_timeout => 5 => 5
mssql.datetimeconvert => On => On
mssql.max_links => Unlimited => Unlimited
mssql.max_persistent => Unlimited => Unlimited
mssql.max_procs => Unlimited => Unlimited
mssql.min_error_severity => 10 => 10
mssql.min_message_severity => 10 => 10
mssql.secure_connection => Off => Off
mssql.textlimit => Server default => Server default
mssql.textsize => Server default => Server default
mssql.timeout => 60 => 60

mysql

MySQL Support => enabled
Active Persistent Links => 0
Active Links => 0
Client API version => 4.1.13a
MYSQL_MODULE_TYPE => external
MYSQL_SOCKET => /var/mysql/mysql.sock
MYSQL_INCLUDE => -I/usr/include/mysql
MYSQL_LIBS => -L/usr/lib/mysql -lmysqlclient 

Directive => Local Value => Master Value
mysql.allow_persistent => On => On
mysql.connect_timeout => 60 => 60
mysql.default_host => no value => no value
mysql.default_password => no value => no value
mysql.default_port => no value => no value
mysql.default_socket => no value => no value
mysql.default_user => no value => no value
mysql.max_links => Unlimited => Unlimited
mysql.max_persistent => Unlimited => Unlimited
mysql.trace_mode => Off => Off

mysqli

MysqlI Support => enabled
Client API library version => 4.1.13a
Client API header version => 4.1.13a
MYSQLI_SOCKET => /var/mysql/mysql.sock

Directive => Local Value => Master Value
mysqli.default_host => localhost => localhost
mysqli.default_port => 3306 => 3306
mysqli.default_pw => no value => no value
mysqli.default_socket => no value => no value
mysqli.default_user => no value => no value
mysqli.max_links => Unlimited => Unlimited
mysqli.reconnect => Off => Off

odbc

ODBC Support => enabled
Active Persistent Links => 0
Active Links => 0
ODBC library => iodbc
ODBC_INCLUDE => -I/usr/include
ODBC_LFLAGS => -L/usr/lib
ODBC_LIBS => -liodbc

Directive => Local Value => Master Value
odbc.allow_persistent => On => On
odbc.check_persistent => On => On
odbc.default_db => no value => no value
odbc.default_pw => no value => no value
odbc.default_user => no value => no value
odbc.defaultbinmode => return as is => return as is
odbc.defaultlrl => return up to 4096 bytes => return up to 4096 bytes
odbc.max_links => Unlimited => Unlimited
odbc.max_persistent => Unlimited => Unlimited

openssl

OpenSSL support => enabled
OpenSSL Version => OpenSSL 0.9.7i 14 Oct 2005

pcre

PCRE (Perl Compatible Regular Expressions) Support => enabled
PCRE Library Version => 6.7 04-Jul-2006

PDO

PDO support => enabled
PDO drivers => sqlite2, sqlite, mysql

pdo_mysql

PDO Driver for MySQL, client library version => 4.1.13a

pdo_sqlite

PDO Driver for SQLite 3.x => enabled
PECL Module version => (bundled) 1.0.1 $Id: pdo_sqlite.c,v 1.10.2.6.2.1 2007/01/01 09:36:05 sebastian
Exp $
SQLite Library => 3.3.7

posix

Revision => $Revision: 1.70.2.3.2.12 $

Reflection

Reflection => enabled
Version => $Id: php_reflection.c,v 1.164.2.33.2.33 2007/01/01 09:36:05 sebastian Exp $

session

Session Support => enabled
Registered save handlers => files user sqlite 
Registered serializer handlers => php php_binary 

Directive => Local Value => Master Value
session.auto_start => Off => Off
session.bug_compat_42 => On => On
session.bug_compat_warn => On => On
session.cache_expire => 180 => 180
session.cache_limiter => nocache => nocache
session.cookie_domain => no value => no value
session.cookie_httponly => Off => Off
session.cookie_lifetime => 0 => 0
session.cookie_path => / => /
session.cookie_secure => Off => Off
session.entropy_file => no value => no value
session.entropy_length => 0 => 0
session.gc_divisor => 100 => 100
session.gc_maxlifetime => 1440 => 1440
session.gc_probability => 1 => 1
session.hash_bits_per_character => 4 => 4
session.hash_function => 0 => 0
session.name => PHPSESSID => PHPSESSID
session.referer_check => no value => no value
session.save_handler => files => files
session.save_path => /var/php/session => /var/php/session
session.serialize_handler => php => php
session.use_cookies => On => On
session.use_only_cookies => Off => Off
session.use_trans_sid => 0 => 0

SimpleXML

Simplexml support => enabled
Revision => $Revision: 1.151.2.22.2.20 $
Schema support => enabled

soap

Soap Client => enabled
Soap Server => enabled

Directive => Local Value => Master Value
soap.wsdl_cache => 1 => 1
soap.wsdl_cache_dir => /tmp => /tmp
soap.wsdl_cache_enabled => 1 => 1
soap.wsdl_cache_limit => 5 => 5
soap.wsdl_cache_ttl => 86400 => 86400

sockets

Sockets Support => enabled

SPL

SPL support => enabled
Interfaces => Countable, OuterIterator, RecursiveIterator, SeekableIterator, SplObserver, SplSubject
Classes => AppendIterator, ArrayIterator, ArrayObject, BadFunctionCallException,
BadMethodCallException, CachingIterator, DirectoryIterator, DomainException, EmptyIterator,
FilterIterator, InfiniteIterator, InvalidArgumentException, IteratorIterator,
LengthException, LimitIterator, LogicException, NoRewindIterator, OutOfBoundsException,
OutOfRangeException, OverflowException, ParentIterator, RangeException,
RecursiveArrayIterator, RecursiveCachingIterator, RecursiveDirectoryIterator,
RecursiveFilterIterator, RecursiveIteratorIterator, RecursiveRegexIterator, RegexIterator,
RuntimeException, SimpleXMLIterator, SplFileInfo, SplFileObject, SplObjectStorage,
SplTempFileObject, UnderflowException, UnexpectedValueException

SQLite

SQLite support => enabled
PECL Module version => 2.0-dev $Id: sqlite.c,v 1.166.2.13.2.6 2007/01/01 09:36:07 sebastian Exp $
SQLite Library => 2.8.17
SQLite Encoding => iso8859

Directive => Local Value => Master Value
sqlite.assoc_case => 0 => 0

standard

Regex Library => Bundled library enabled
Dynamic Library Support => enabled
Path to sendmail => /usr/sbin/sendmail -t -i 

Directive => Local Value => Master Value
assert.active => 1 => 1
assert.bail => 0 => 0
assert.callback => no value => no value
assert.quiet_eval => 0 => 0
assert.warning => 1 => 1
auto_detect_line_endings => 0 => 0
default_socket_timeout => 60 => 60
safe_mode_allowed_env_vars => PHP_ => PHP_
safe_mode_protected_env_vars => LD_LIBRARY_PATH => LD_LIBRARY_PATH
url_rewriter.tags => a=href,area=href,frame=src,input=src,form=,fieldset= => a=href,area=href,frame=src,input=src,form=,fieldset=
user_agent => no value => no value

sysvmsg

sysvmsg support => enabled
Revision => $Revision: 1.20.2.3.2.6 $

tokenizer

Tokenizer Support => enabled

xml

XML Support => active
XML Namespace Support => active
libxml2 Version => 2.6.16

xmlreader

XMLReader => enabled

xmlwriter

XMLWriter => enabled

zlib

ZLib Support => enabled
Stream Wrapper support => compress.zlib://
Stream Filter support => zlib.inflate, zlib.deflate
Compiled Version => 1.2.3
Linked Version => 1.2.3

Directive => Local Value => Master Value
zlib.output_compression => Off => Off
zlib.output_compression_level => -1 => -1
zlib.output_handler => no value => no value

Additional Modules

Module Name
sysvsem
sysvshm

Environment

Variable => Value
MANPATH => /sw/share/man:/usr/share/man:/usr/X11R6/man:/sw/lib/perl5/5.8.6/man
TEST_PHP_SRCDIR => /Users/cah/src/php-5.2.1
SHELL => /bin/sh
TERM => xterm-color
MAKEFLAGS =>  
SSH_CLIENT => deleted
PERL5LIB => /sw/lib/perl5:/sw/lib/perl5/darwin
SSH_TTY => deleted
USER => cah
SSH_AUTH_SOCK => deleted
__CF_USER_TEXT_ENCODING => 0x401:0:0
MAKELEVEL => 1
MFLAGS =>  
PATH => /sw/bin:/sw/sbin:/bin:/sbin:/usr/bin:/usr/sbin:/usr/local/bin:/usr/X11R6/bin
MAIL => /var/mail/cah
_ => /Users/cah/src/php-5.2.1/sapi/cli/php
PWD => /Users/cah/src/php-5.2.1
TEST_PHP_EXECUTABLE => /Users/cah/src/php-5.2.1/sapi/cli/php
HOME => /Users/cah
SHLVL => 3
LOGNAME => cah
SSH_CONNECTION => deleted
INFOPATH => /sw/share/info:/sw/info:/usr/share/info
CC => gcc

PHP Variables

Variable => Value
_SERVER["MANPATH"] => /sw/share/man:/usr/share/man:/usr/X11R6/man:/sw/lib/perl5/5.8.6/man
_SERVER["TEST_PHP_SRCDIR"] => /Users/cah/src/php-5.2.1
_SERVER["SHELL"] => /bin/sh
_SERVER["TERM"] => xterm-color
_SERVER["MAKEFLAGS"] => 
_SERVER["SSH_CLIENT"] => deleted
_SERVER["PERL5LIB"] => /sw/lib/perl5:/sw/lib/perl5/darwin
_SERVER["SSH_TTY"] => deleted
_SERVER["USER"] => cah
_SERVER["SSH_AUTH_SOCK"] => deleted
_SERVER["__CF_USER_TEXT_ENCODING"] => 0x401:0:0
_SERVER["MAKELEVEL"] => 1
_SERVER["MFLAGS"] => 
_SERVER["PATH"] => /sw/bin:/sw/sbin:/bin:/sbin:/usr/bin:/usr/sbin:/usr/local/bin:/usr/X11R6/bin
_SERVER["MAIL"] => /var/mail/cah
_SERVER["_"] => /Users/cah/src/php-5.2.1/sapi/cli/php
_SERVER["PWD"] => /Users/cah/src/php-5.2.1
_SERVER["TEST_PHP_EXECUTABLE"] => /Users/cah/src/php-5.2.1/sapi/cli/php
_SERVER["HOME"] => /Users/cah
_SERVER["SHLVL"] => 3
_SERVER["LOGNAME"] => cah
_SERVER["SSH_CONNECTION"] => deleted
_SERVER["INFOPATH"] => /sw/share/info:/sw/info:/usr/share/info
_SERVER["CC"] => gcc
_SERVER["PHP_SELF"] => 
_SERVER["SCRIPT_NAME"] => 
_SERVER["SCRIPT_FILENAME"] => 
_SERVER["PATH_TRANSLATED"] => 
_SERVER["DOCUMENT_ROOT"] => 
_SERVER["REQUEST_TIME"] => 1171052163
_SERVER["argv"] => Array
(
)

_SERVER["argc"] => 0
_ENV["MANPATH"] => /sw/share/man:/usr/share/man:/usr/X11R6/man:/sw/lib/perl5/5.8.6/man
_ENV["TEST_PHP_SRCDIR"] => /Users/cah/src/php-5.2.1
_ENV["SHELL"] => /bin/sh
_ENV["TERM"] => xterm-color
_ENV["MAKEFLAGS"] => 
_ENV["SSH_CLIENT"] => deleted
_ENV["PERL5LIB"] => /sw/lib/perl5:/sw/lib/perl5/darwin
_ENV["SSH_TTY"] => deleted
_ENV["USER"] => cah
_ENV["SSH_AUTH_SOCK"] => deleted
_ENV["__CF_USER_TEXT_ENCODING"] => 0x401:0:0
_ENV["MAKELEVEL"] => 1
_ENV["MFLAGS"] => 
_ENV["PATH"] => /sw/bin:/sw/sbin:/bin:/sbin:/usr/bin:/usr/sbin:/usr/local/bin:/usr/X11R6/bin
_ENV["MAIL"] => /var/mail/cah
_ENV["_"] => /Users/cah/src/php-5.2.1/sapi/cli/php
_ENV["PWD"] => /Users/cah/src/php-5.2.1
_ENV["TEST_PHP_EXECUTABLE"] => /Users/cah/src/php-5.2.1/sapi/cli/php
_ENV["HOME"] => /Users/cah
_ENV["SHLVL"] => 3
_ENV["LOGNAME"] => cah
_ENV["SSH_CONNECTION"] => deleted
_ENV["INFOPATH"] => /sw/share/info:/sw/info:/usr/share/info
_ENV["CC"] => gcc

PHP License
This program is free software; you can redistribute it and/or modify
it under the terms of the PHP License as published by the PHP Group
and included in the distribution in the file:  LICENSE

This program is distributed in the hope that it will be useful,
but WITHOUT ANY WARRANTY; without even the implied warranty of
MERCHANTABILITY or FITNESS FOR A PARTICULAR PURPOSE.

If you did not receive a copy of the PHP license, or have any
questions about PHP licensing, please contact license <at> php.net.

--

-- 
PHP Quality Assurance Mailing List <http://www.php.net/>
To unsubscribe, visit: http://www.php.net/unsub.php


Gmane