jeroen.dobbelaere | 1 Sep 01:38 2003

Results for 3.5-tree-ssa 20030831 (merged 20030817) testsuite on armv5l-unknown-linux-gnu

kernel : 2.4.16-rmk1-xng1
binutils-2.14.90.0.4 + 'default float on arm-linux' patch
glibc-2.2.5 + arm patch

gcc/cfgcleanup.c:merge_blocks : added 'BB_DIRTY' when merging 'non-move'

'make bootstrap' failed with :
LIB2_DIVMOD_FUNCS='_divdi3 _moddi3 _udivdi3 _umoddi3 _udiv_w_sdiv _udivmoddi4' \\
DPBIT='' \\
DPBIT_FUNCS='_pack_df _unpack_df _addsub_df _mul_df _div_df _fpcmp_parts_df _compare_df _eq_df
_ne_df _gt_df _ge_df _lt_df _le_df _unord_df _si_to_df _df_to_si _negate_df _make_df _df_to_sf
_df_to_tf _thenan_df _df_to_usi _usi_to_df' \\
TPBIT='' \\
TPBIT_FUNCS='_pack_tf _unpack_tf _addsub_tf _mul_tf _div_tf _fpcmp_parts_tf _compare_tf _eq_tf
_ne_tf _gt_tf _ge_tf _lt_tf _le_tf _unord_tf _si_to_tf _tf_to_si _negate_tf _make_tf _tf_to_df
_tf_to_sf _thenan_tf _tf_to_usi _usi_to_tf'
\\
MULTILIBS=\`/usr/src/cvs-others/gcc-trees/gcc-tree-ssa-20020619-branch/build-tmp-0/gcc/xgcc
-B/usr/src/cvs-others/gcc-trees/gcc-tree-ssa-20020619-branch/build-tmp-0/gcc/
-B/usr/local/gcc-3.5-cvs/armv5l-unknown-linux-gnu/bin/
-B/usr/local/gcc-3.5-cvs/armv5l-unknown-linux-gnu/lib/ -isystem
/usr/local/gcc-3.5-cvs/armv5l-unknown-linux-gnu/include -isystem
/usr/local/gcc-3.5-cvs/armv5l-unknown-linux-gnu/sys-include --print-multi-lib\` \\
EXTRA_MULTILIB_PARTS=''
\\
SHLIB_LINK='/usr/src/cvs-others/gcc-trees/gcc-tree-ssa-20020619-branch/build-tmp-0/gcc/xgcc
-B/usr/src/cvs-others/gcc-trees/gcc-tree-ssa-20020619-branch/build-tmp-0/gcc/
-B/usr/local/gcc-3.5-cvs/armv5l-unknown-linux-gnu/bin/
-B/usr/local/gcc-3.5-cvs/armv5l-unknown-linux-gnu/lib/ -isystem
/usr/local/gcc-3.5-cvs/armv5l-unknown-linux-gnu/include -isystem
(Continue reading)

Robert Schiele | 1 Sep 01:52 2003
Picon

Results for 3.3.2 20030831 (prerelease) testsuite on i586-suse-linux-gnu

Attachment: application/octet-stream, 3206 bytes
Robert Schiele | 1 Sep 01:56 2003
Picon

*** bootstrap fails for 3.4 20030831 (experimental) on i586-suse-linux-gnu

LAST_UPDATED: Sun Aug 31 22:50:18 UTC 2003

Native configuration is i586-suse-linux-gnu

              === configure ===

[...]
creating cache ./config.cache
checking host system type... i586-suse-linux-gnu
checking target system type... i586-suse-linux-gnu
checking build system type... i586-suse-linux-gnu
checking for a BSD compatible install... /usr/bin/install -c
*** This configuration is not supported in the following subdirectories:
     target-libffi target-boehm-gc target-zlib target-libjava zlib fastjar
    (Any other directories should still work fine.)
checking for i586-suse-linux-ar... no
checking for ar... ar
checking for i586-suse-linux-as... no
checking for as... as
checking for i586-suse-linux-dlltool... no
checking for dlltool... dlltool
checking for i586-suse-linux-ld... no
checking for ld... ld
checking for i586-suse-linux-nm... no
checking for nm... nm
checking for i586-suse-linux-ranlib... no
checking for ranlib... ranlib
checking for i586-suse-linux-windres... no
checking for windres... windres
checking for i586-suse-linux-objcopy... no
checking for objcopy... objcopy
checking for i586-suse-linux-objdump... no
checking for objdump... objdump
checking for i586-suse-linux-ar... no
checking for ar... ar
checking for i586-suse-linux-as... no
checking for as... as
checking for i586-suse-linux-dlltool... no
checking for dlltool... dlltool
checking for i586-suse-linux-ld... no
checking for ld... ld
checking for i586-suse-linux-nm... no
checking for nm... nm
checking for i586-suse-linux-ranlib... no
checking for ranlib... ranlib
checking for i586-suse-linux-windres... no
checking for windres... windres
checking whether to enable maintainer-specific portions of Makefiles... no
updating cache ./config.cache
creating ./config.status
creating Makefile

              === make bootstrap ===

[...]
mv: cannot stat `specs': No such file or directory
mv: cannot stat `collect2': No such file or directory
mv: cannot stat `gcov': No such file or directory
mv: cannot stat `gcov-dump': No such file or directory
mv: cannot stat `*.[0-9][0-9].*': No such file or directory
mv: cannot stat `*.[si]': No such file or directory
mv: cannot stat `g++-cross': No such file or directory
mv: cannot stat `cc1plus': No such file or directory
mv: cannot stat `g77-cross': No such file or directory
mv: cannot stat `f771': No such file or directory
mv: cannot stat `cc1obj': No such file or directory
gmake[2]: [stage1-start] Error 1 (ignored)
if [ -f as ] ; then (cd stage1 && ln -s ../as .) ; else true ; fi
if [ -f ld ] ; then (cd stage1 && ln -s ../ld .) ; else true ; fi
if [ -f collect-ld ] ; then (cd stage1 && ln -s ../collect-ld .) ; else true ; fi
rm -f stage1/libgcc.a stage1/libgcc_eh.a stage1/libgcov.a
cp libgcc.a stage1
` if [ -f /local/build/gcc/../binutils/ranlib ] ; then echo /local/build/gcc/../binutils/ranlib ;
else if [ "i586-suse-linux-gnu" = "i586-suse-linux-gnu" ] ; then echo ranlib; else t='s,x,x,'; echo
ranlib | sed -e $t ; fi; fi` stage1/libgcc.a
cp libgcov.a stage1
` if [ -f /local/build/gcc/../binutils/ranlib ] ; then echo /local/build/gcc/../binutils/ranlib ;
else if [ "i586-suse-linux-gnu" = "i586-suse-linux-gnu" ] ; then echo ranlib; else t='s,x,x,'; echo
ranlib | sed -e $t ; fi; fi` stage1/libgcov.a
if [ -f libgcc_eh.a ] ; then cp libgcc_eh.a stage1; \
   ` if [ -f /local/build/gcc/../binutils/ranlib ] ; then echo /local/build/gcc/../binutils/ranlib ;
else if [ "i586-suse-linux-gnu" = "i586-suse-linux-gnu" ] ; then echo ranlib; else t='s,x,x,'; echo
ranlib | sed -e $t ; fi; fi` stage1/libgcc_eh.a; \
fi
for f in .. ; do if [ x${f} != x.. ]; then \
  cp stage1/${f} . ; \
else true; \
fi; done
mv cp/*.o stage1/cp
mv: cannot stat `cp/*.o': No such file or directory
gmake[2]: [c++.stage1] Error 1 (ignored)
mv -f f/*.o f/fini f/stamp-str f/str-*.h f/str-*.j g77spec.o stage1/f
mv: cannot stat `f/*.o': No such file or directory
mv: cannot stat `f/fini': No such file or directory
mv: cannot stat `f/stamp-str': No such file or directory
mv: cannot stat `f/str-*.h': No such file or directory
mv: cannot stat `f/str-*.j': No such file or directory
mv: cannot stat `g77spec.o': No such file or directory
gmake[2]: [f77.stage1] Error 1 (ignored)
mv objc/*.o stage1/objc
mv: cannot stat `objc/*.o': No such file or directory
gmake[2]: [objc.stage1] Error 1 (ignored)
for dir in . cp f objc ; \
do \
  rm -f $dir/*.{gcda,gcno} ; \
done
gmake[2]: Leaving directory `/local/build/gcc'
echo timestamp > stage1_copy
echo stage2_build > stage_last
gmake CC=" stage1/xgcc -Bstage1/ -B/local/inst/gcc34/i586-suse-linux/bin/" CC_FOR_BUILD="
stage1/xgcc -Bstage1/ -B/local/inst/gcc34/i586-suse-linux/bin/" \
	 STAGE_PREFIX=stage1/ \
	 ADAC="\$(CC)" CFLAGS="-g -O2" LDFLAGS="" WARN_CFLAGS="\$(GCC_WARN_CFLAGS)"
STRICT_WARN="-pedantic -Wno-long-long -Werror" libdir=/local/inst/gcc34/lib LANGUAGES="c gcov
gcov-dump c++ f77 objc" MAKEOVERRIDES= OUTPUT_OPTION="-o \$ <at> " \
	 CFLAGS="-g -O2" WERROR="-Werror" 
gmake[2]: Entering directory `/local/build/gcc'
stage1/xgcc -Bstage1/ -B/local/inst/gcc34/i586-suse-linux/bin/ -c   -g -O2 -DIN_GCC   -W -Wall
-Wwrite-strings -Wstrict-prototypes -Wmissing-prototypes -pedantic -Wno-long-long -Werror   
-DHAVE_CONFIG_H -DGENERATOR_FILE    -I. -I. -I/local/src/gcc/gcc -I/local/src/gcc/gcc/.
-I/local/src/gcc/gcc/../include  /local/src/gcc/gcc/gengenrtl.c -o gengenrtl.o
stage1/xgcc -Bstage1/ -B/local/inst/gcc34/i586-suse-linux/bin/   -g -O2 -DIN_GCC   -W -Wall
-Wwrite-strings -Wstrict-prototypes -Wmissing-prototypes -pedantic -Wno-long-long -Werror   
-DHAVE_CONFIG_H -DGENERATOR_FILE  -o gengenrtl \
 gengenrtl.o ../libiberty/libiberty.a
./gengenrtl -h > tmp-genrtl.h
/bin/sh /local/src/gcc/gcc/move-if-change tmp-genrtl.h genrtl.h
./gengenrtl > tmp-genrtl.c
/bin/sh /local/src/gcc/gcc/move-if-change tmp-genrtl.c genrtl.c
echo timestamp > s-genrtl
stage1/xgcc -Bstage1/ -B/local/inst/gcc34/i586-suse-linux/bin/ -c   -g -O2 -DIN_GCC   -W -Wall
-Wwrite-strings -Wstrict-prototypes -Wmissing-prototypes -pedantic -Wno-long-long -Werror   
-DHAVE_CONFIG_H -DGENERATOR_FILE    -I. -I. -I/local/src/gcc/gcc -I/local/src/gcc/gcc/.
-I/local/src/gcc/gcc/../include  /local/src/gcc/gcc/genconstants.c -o genconstants.o
echo "/* This file is machine generated.  Do not edit.  */" > tmp-gtyp.h
echo "static const char *const srcdir = "  >> tmp-gtyp.h
echo "\"/local/src/gcc/gcc\"" >> tmp-gtyp.h
echo ";" >> tmp-gtyp.h
echo "static const char *const lang_files[] = {" >> tmp-gtyp.h
ll="/local/src/gcc/gcc/cp/mangle.c  /local/src/gcc/gcc/cp/name-lookup.h 
/local/src/gcc/gcc/cp/name-lookup.c  /local/src/gcc/gcc/cp/cp-tree.h 
/local/src/gcc/gcc/cp/decl.h  /local/src/gcc/gcc/cp/lex.h  /local/src/gcc/gcc/cp/call.c 
/local/src/gcc/gcc/cp/decl.c  /local/src/gcc/gcc/cp/decl2.c  /local/src/gcc/gcc/cp/pt.c 
/local/src/gcc/gcc/cp/repo.c  /local/src/gcc/gcc/cp/semantics.c  /local/src/gcc/gcc/cp/tree.c 
/local/src/gcc/gcc/cp/parser.c  /local/src/gcc/gcc/cp/method.c  /local/src/gcc/gcc/c-common.c 
/local/src/gcc/gcc/c-common.h  /local/src/gcc/gcc/c-pragma.c  /local/src/gcc/gcc/f/com.c 
/local/src/gcc/gcc/f/com.h  /local/src/gcc/gcc/f/ste.c  /local/src/gcc/gcc/f/where.h 
/local/src/gcc/gcc/f/where.c  /local/src/gcc/gcc/f/lex.c  /local/src/gcc/gcc/objc/objc-act.h 
/local/src/gcc/gcc/c-parse.in  /local/src/gcc/gcc/c-tree.h  /local/src/gcc/gcc/c-decl.c 
/local/src/gcc/gcc/c-objc-common.c  /local/src/gcc/gcc/c-common.c 
/local/src/gcc/gcc/c-common.h  /local/src/gcc/gcc/c-pragma.c 
/local/src/gcc/gcc/objc/objc-act.c  /local/src/gcc/gcc/c-lang.c 
/local/src/gcc/gcc/c-parse.in  /local/src/gcc/gcc/c-tree.h  /local/src/gcc/gcc/c-decl.c 
/local/src/gcc/gcc/c-common.c  /local/src/gcc/gcc/c-common.h  /local/src/gcc/gcc/c-pragma.c 
/local/src/gcc/gcc/c-objc-common.c "; \
for f in $ll; do \
echo "\"$f\", "; done >> tmp-gtyp.h
echo "NULL};" >> tmp-gtyp.h
echo "static const char *const langs_for_lang_files[] = {" >> tmp-gtyp.h
ff="cp  cp  cp  cp  cp  cp  cp  cp  cp  cp  cp  cp  cp  cp  cp  cp  cp  cp  f  f  f  f  f  f  objc  objc  objc  objc  objc  objc  objc  objc  objc  c  c  c  c  c  c  c  c
"; \
for f in $ff; do \
echo "\"$f\", " ; done  >> tmp-gtyp.h
echo "NULL};" >> tmp-gtyp.h
echo "static const char *const all_files[] = {" >> tmp-gtyp.h
gf="/local/src/gcc/gcc/input.h /local/src/gcc/gcc/coretypes.h /local/src/gcc/gcc/cpplib.h
auto-host.h /local/src/gcc/gcc/../include/ansidecl.h /local/src/gcc/gcc/config/i386/i386.h
/local/src/gcc/gcc/config/i386/unix.h /local/src/gcc/gcc/config/i386/att.h
/local/src/gcc/gcc/config/dbxelf.h /local/src/gcc/gcc/config/elfos.h
/local/src/gcc/gcc/config/svr4.h /local/src/gcc/gcc/config/linux.h
/local/src/gcc/gcc/config/i386/linux.h /local/src/gcc/gcc/defaults.h
/local/src/gcc/gcc/../include/hashtab.h /local/src/gcc/gcc/../include/splay-tree.h
/local/src/gcc/gcc/bitmap.h /local/src/gcc/gcc/coverage.c /local/src/gcc/gcc/function.h 
/local/src/gcc/gcc/rtl.h /local/src/gcc/gcc/optabs.h /local/src/gcc/gcc/tree.h
/local/src/gcc/gcc/libfuncs.h /local/src/gcc/gcc/hashtable.h /local/src/gcc/gcc/real.h
/local/src/gcc/gcc/varray.h /local/src/gcc/gcc/ssa.h /local/src/gcc/gcc/insn-addr.h
/local/src/gcc/gcc/cselib.h /local/src/gcc/gcc/basic-block.h  /local/src/gcc/gcc/cgraph.h
/local/src/gcc/gcc/c-common.h /local/src/gcc/gcc/c-tree.h /local/src/gcc/gcc/alias.c
/local/src/gcc/gcc/bitmap.c /local/src/gcc/gcc/cselib.c /local/src/gcc/gcc/cgraph.c
/local/src/gcc/gcc/dbxout.c /local/src/gcc/gcc/dwarf2out.c /local/src/gcc/gcc/dwarf2asm.c
/local/src/gcc/gcc/emit-rtl.c /local/src/gcc/gcc/except.c /local/src/gcc/gcc/explow.c
/local/src/gcc/gcc/expr.c /local/src/gcc/gcc/fold-const.c /local/src/gcc/gcc/function.c
/local/src/gcc/gcc/gcse.c /local/src/gcc/gcc/integrate.c /local/src/gcc/gcc/lists.c
/local/src/gcc/gcc/optabs.c /local/src/gcc/gcc/profile.c /local/src/gcc/gcc/ra-build.c
/local/src/gcc/gcc/regclass.c /local/src/gcc/gcc/reg-stack.c /local/src/gcc/gcc/cfglayout.c
/local/src/gcc/gcc/langhooks.c /local/src/gcc/gcc/sdbout.c /local/src/gcc/gcc/stmt.c
/local/src/gcc/gcc/stor-layout.c /local/src/gcc/gcc/stringpool.c /local/src/gcc/gcc/tree.c
/local/src/gcc/gcc/varasm.c /local/src/gcc/gcc/config/i386/i386.c
/local/src/gcc/gcc/cp/mangle.c /local/src/gcc/gcc/cp/name-lookup.h
/local/src/gcc/gcc/cp/name-lookup.c /local/src/gcc/gcc/cp/cp-tree.h
/local/src/gcc/gcc/cp/decl.h /local/src/gcc/gcc/cp/lex.h /local/src/gcc/gcc/cp/call.c
/local/src/gcc/gcc/cp/decl.c /local/src/gcc/gcc/cp/decl2.c /local/src/gcc/gcc/cp/pt.c
/local/src/gcc/gcc/cp/repo.c /local/src/gcc/gcc/cp/semantics.c /local/src/gcc/gcc/cp/tree.c
/local/src/gcc/gcc/cp/parser.c /local/src/gcc/gcc/cp/method.c /local/src/gcc/gcc/c-common.c
/local/src/gcc/gcc/c-common.h /local/src/gcc/gcc/c-pragma.c /local/src/gcc/gcc/f/com.c
/local/src/gcc/gcc/f/com.h /local/src/gcc/gcc/f/ste.c /local/src/gcc/gcc/f/where.h
/local/src/gcc/gcc/f/where.c /local/src/gcc/gcc/f/lex.c /local/src/gcc/gcc/objc/objc-act.h
/local/src/gcc/gcc/c-parse.in /local/src/gcc/gcc/c-tree.h /local/src/gcc/gcc/c-decl.c
/local/src/gcc/gcc/c-objc-common.c /local/src/gcc/gcc/c-common.c
/local/src/gcc/gcc/c-common.h /local/src/gcc/gcc/c-pragma.c
/local/src/gcc/gcc/objc/objc-act.c /local/src/gcc/gcc/c-lang.c
/local/src/gcc/gcc/c-parse.in /local/src/gcc/gcc/c-tree.h /local/src/gcc/gcc/c-decl.c
/local/src/gcc/gcc/c-common.c /local/src/gcc/gcc/c-common.h /local/src/gcc/gcc/c-pragma.c
/local/src/gcc/gcc/c-objc-common.c"; \
for f in $gf; do \
echo "\"$f\", "; done >> tmp-gtyp.h
echo " NULL};" >> tmp-gtyp.h
echo "static const char *const lang_dir_names[] = { \"c\", " >> tmp-gtyp.h
gf="cp f objc"; \
for l in $gf; do \
echo "\"$l\", "; done >> tmp-gtyp.h
echo "NULL};" >> tmp-gtyp.h
/bin/sh /local/src/gcc/gcc/move-if-change tmp-gtyp.h gtyp-gen.h 
stage1/xgcc -Bstage1/ -B/local/inst/gcc34/i586-suse-linux/bin/ -c   -g -O2 -DIN_GCC   -W -Wall
-Wwrite-strings -Wstrict-prototypes -Wmissing-prototypes -pedantic -Wno-long-long -Werror   
-DHAVE_CONFIG_H -DGENERATOR_FILE    -I. -I. -I/local/src/gcc/gcc -I/local/src/gcc/gcc/.
-I/local/src/gcc/gcc/../include  \
  /local/src/gcc/gcc/gengtype.c -o gengtype.o
/local/src/gcc/gcc/gengtype.c: In function `adjust_field_tree_exp':

/local/src/gcc/gcc/gengtype.c:718: internal compiler error: Segmentation fault
Please submit a full bug report,
with preprocessed source if appropriate.
See <URL:http://gcc.gnu.org/bugs.html> for instructions.
gmake[2]: *** [gengtype.o] Error 1
gmake[2]: Leaving directory `/local/build/gcc'
gmake[1]: *** [stage2_build] Error 2
gmake[1]: Leaving directory `/local/build/gcc'
gmake: *** [bootstrap] Error 2

Compiler version: 3.4 20030831 (experimental)
Platform: i586-suse-linux-gnu
configure flags: --enable-threads=posix --prefix=/local/inst/gcc34
--enable-languages=c,c++,f77,objc --disable-checking --disable-libgcj
--with-gxx-include-dir=/local/inst/gcc34/include/g++ --with-system-zlib --enable-shared
--enable-__cxa_atexit i586-suse-linux

Loren James Rittle | 1 Sep 03:21 2003
Picon

Results for 3.3.2 20030831 (prerelease) testsuite on alpha-unknown-freebsd5.1

Using gmake with objdir configuration on beast (see key)

LAST_UPDATED: Sun Aug 31 20:52:52 GMT 2003

Native configuration is alpha-unknown-freebsd5.1

		=== libjava tests ===

Running target unix/-pthread
FAIL: SyncTest execution - source compiled test
FAIL: SyncTest -O execution - source compiled test
FAIL: SyncTest output - gij test
WARNING: program timed out.
FAIL: SyncTest -O execution - bytecode->native test
FAIL: Thread_Monitor execution - bytecode->native test
FAIL: Thread_Monitor execution - gij test
FAIL: Throw_2 execution - source compiled test
FAIL: Throw_2 execution - gij test
FAIL: Throw_2 execution - bytecode->native test
FAIL: Throw_2 -O execution - source compiled test
FAIL: Throw_2 execution - gij test
FAIL: Throw_2 -O execution - bytecode->native test
FAIL: initexc execution - gij test
FAIL: initexc execution - gij test

		=== libjava Summary ===

# of expected passes		2964
# of unexpected failures	14
# of expected failures		16
# of untested testcases		25
		=== libstdc++-v3 tests ===

Running target unix/-pthread
FAIL: 18_support/numeric_limits.cc execution test
XPASS: 22_locale/ctype_is_wchar_t.cc execution test
WARNING: program timed out.
FAIL: 27_io/filebuf_members.cc execution test
WARNING: program timed out.
FAIL: 27_io/filebuf_virtuals.cc execution test

		=== libstdc++-v3 Summary ===

# of expected passes		450
# of unexpected failures	3
# of unexpected successes	1
# of expected failures		27
		=== g++ tests ===

Running target unix/-pthread
FAIL: g++.dg/expr/anew1.C execution test
FAIL: g++.dg/expr/anew2.C execution test
FAIL: g++.dg/expr/anew3.C execution test
FAIL: g++.dg/expr/anew4.C execution test
FAIL: g++.dg/tls/init-2.C (test for excess errors)
FAIL: g++.eh/badalloc1.C  Execution test
FAIL: g++.law/profile1.C (test for excess errors)
FAIL: g++.pt/repo3.C (test for excess errors)

		=== g++ Summary ===

# of expected passes		8056
# of unexpected failures	8
# of expected failures		96
# of untested testcases		22
# of unsupported tests		27
/j/ljrittle/gcc-build-beast-0831/gcc/testsuite/../g++ version 3.3.2 20030831 (prerelease)

		=== g77 tests ===

Running target unix/-pthread

		=== g77 Summary ===

# of expected passes		1686
# of unsupported tests		8
/j/ljrittle/gcc-build-beast-0831/gcc/testsuite/../g77 version 3.3.2 20030831 (prerelease)

		=== gcc tests ===

Running target unix/-pthread
FAIL: gcc.c-torture/execute/20020227-1.c compilation,  -O0 
UNRESOLVED: gcc.c-torture/execute/20020227-1.c execution,  -O0 
FAIL: gcc.c-torture/execute/20020227-1.c compilation,  -O1 
UNRESOLVED: gcc.c-torture/execute/20020227-1.c execution,  -O1 
FAIL: gcc.c-torture/execute/20020227-1.c compilation,  -O2 
UNRESOLVED: gcc.c-torture/execute/20020227-1.c execution,  -O2 
FAIL: gcc.c-torture/execute/20020227-1.c compilation,  -O3 -fomit-frame-pointer 
UNRESOLVED: gcc.c-torture/execute/20020227-1.c execution,  -O3 -fomit-frame-pointer 
FAIL: gcc.c-torture/execute/20020227-1.c compilation,  -O3 -g 
UNRESOLVED: gcc.c-torture/execute/20020227-1.c execution,  -O3 -g 
FAIL: gcc.c-torture/execute/20020227-1.c compilation,  -Os 
UNRESOLVED: gcc.c-torture/execute/20020227-1.c execution,  -Os 
FAIL: gcc.c-torture/execute/simd-2.c compilation,  -O3 -fomit-frame-pointer 
UNRESOLVED: gcc.c-torture/execute/simd-2.c execution,  -O3 -fomit-frame-pointer 
FAIL: gcc.c-torture/execute/simd-2.c compilation,  -O3 -g 
UNRESOLVED: gcc.c-torture/execute/simd-2.c execution,  -O3 -g 
FAIL: gcc.dg/20020607-2.c (test for excess errors)
WARNING: gcc.dg/20020607-2.c compilation failed to produce executable
FAIL: gcc.dg/20021014-1.c (test for excess errors)
WARNING: gcc.dg/20021014-1.c compilation failed to produce executable
FAIL: gcc.dg/duff-2.c (test for excess errors)
FAIL: gcc.dg/fastmath-1.c (test for excess errors)
WARNING: gcc.dg/fastmath-1.c compilation failed to produce executable
FAIL: gcc.dg/fnegate-1.c (test for excess errors)
WARNING: gcc.dg/fnegate-1.c compilation failed to produce executable
FAIL: gcc.dg/nest.c (test for excess errors)
WARNING: gcc.dg/nest.c compilation failed to produce executable

		=== gcc Summary ===

# of expected passes		21360
# of unexpected failures	14
# of expected failures		72
# of unresolved testcases	8
# of unsupported tests		168
/j/ljrittle/gcc-build-beast-0831/gcc/xgcc version 3.3.2 20030831 (prerelease)

		=== objc tests ===

Running target unix/-pthread
FAIL: objc/execute/class-13.m compilation,  -O3 -fomit-frame-pointer 
UNRESOLVED: objc/execute/class-13.m execution,  -O3 -fomit-frame-pointer 
FAIL: objc/execute/class-13.m compilation,  -O3 -g 
UNRESOLVED: objc/execute/class-13.m execution,  -O3 -g 
FAIL: objc/execute/class-6.m compilation,  -O3 -fomit-frame-pointer 
UNRESOLVED: objc/execute/class-6.m execution,  -O3 -fomit-frame-pointer 
FAIL: objc/execute/class-6.m compilation,  -O3 -g 
UNRESOLVED: objc/execute/class-6.m execution,  -O3 -g 
FAIL: objc/execute/object_is_class.m compilation,  -O3 -fomit-frame-pointer 
UNRESOLVED: objc/execute/object_is_class.m execution,  -O3 -fomit-frame-pointer 
FAIL: objc/execute/object_is_class.m compilation,  -O3 -g 
UNRESOLVED: objc/execute/object_is_class.m execution,  -O3 -g 
FAIL: objc/execute/object_is_meta_class.m compilation,  -O3 -fomit-frame-pointer 
UNRESOLVED: objc/execute/object_is_meta_class.m execution,  -O3 -fomit-frame-pointer 
FAIL: objc/execute/object_is_meta_class.m compilation,  -O3 -g 
UNRESOLVED: objc/execute/object_is_meta_class.m execution,  -O3 -g 

		=== objc Summary ===

# of expected passes		1137
# of unexpected failures	8
# of unresolved testcases	8
/j/ljrittle/gcc-build-beast-0831/gcc/xgcc version 3.3.2 20030831 (prerelease)

Compiler version: 3.3.2 20030831 (prerelease) 
Platform: alpha-unknown-freebsd5.1
configure flags: --host=alpha-unknown-freebsd5.1
--prefix=/home/ljrittle/beast/tmp/install-beast --with-gnu-as --with-as=/usr/bin/as
--with-gnu-ld --with-ld=/usr/bin/ld
BOOT_CFLAGS=-g -O2
Key: gmake is GNU make
     make is BSD make as shipped on alpha-unknown-freebsd5.1
     srcdir means in-source configuration was done within the gcc source tree
     objdir means out-source configuration was done within a fresh directory
ref4 (3.3) and ref5 (mainline) attempt to build gcc twice daily;
once for srcdir configuration and once for objdir configuration;
odd number days use GNU make; even days use BSD make; missing
reports infer breakage; partial reports are made when bootstap
completes in gcc but fails in a support library.
beast (3.3) builds gcc once daily using gmake with objdir conf.
See http://people.freebsd.org/~ljrittle/daily-gcc-bootstrap-reports
for all related transcript logs and log.sent files (not staged
until after all daily bootstraps for a machine complete).

Andreas Tobler | 1 Sep 06:21 2003
Picon

Results for 3.3.2 20030831 (prerelease) testsuite on powerpc-unknown-linux-gnu


LAST_UPDATED: Sun Aug 31 12:16:20 UTC 2003

Native configuration is powerpc-unknown-linux-gnu

		=== g77 tests ===

Running target unix

		=== g77 Summary ===

# of expected passes		1686
# of unsupported tests		8
/mnt/cvs/gcc-branch/objdir/gcc/testsuite/../g77 version 3.3.2 20030831 (prerelease)

		=== gcc tests ===

Running target unix
WARNING: program timed out.
FAIL: gcc.c-torture/compile/20001226-1.c,  -O3 -g  
FAIL: gcc.dg/20020103-1.c scan-assembler-not LC
FAIL: gcc.dg/20020118-1.c execution test
FAIL: gcc.dg/altivec-5.c (test for excess errors)
FAIL: gcc.dg/duff-2.c (test for excess errors)

		=== gcc Summary ===

# of expected passes		20938
# of unexpected failures	5
# of expected failures		67
# of unsupported tests		158
/mnt/cvs/gcc-branch/objdir/gcc/xgcc version 3.3.2 20030831 (prerelease)

		=== g++ tests ===

Running target unix
XPASS: g++.dg/other/packed1.C execution test

		=== g++ Summary ===

# of expected passes		8038
# of unexpected successes	1
# of expected failures		95
# of untested testcases		23
# of unsupported tests		28
/mnt/cvs/gcc-branch/objdir/gcc/testsuite/../g++ version 3.3.2 20030831 (prerelease)

		=== objc tests ===

Running target unix

		=== objc Summary ===

# of expected passes		1153
/mnt/cvs/gcc-branch/objdir/gcc/xgcc version 3.3.2 20030831 (prerelease)

		=== libjava tests ===

Running target unix
FAIL: Array_3 -O execution - source compiled test
WARNING: program timed out.
FAIL: SyncTest execution - gij test
WARNING: program timed out.
FAIL: SyncTest execution - gij test

		=== libjava Summary ===

# of expected passes		2985
# of unexpected failures	3
# of expected failures		16
# of untested testcases		15
		=== libstdc++-v3 tests ===

Running target unix
XPASS: 22_locale/collate_byname.cc execution test
XPASS: 22_locale/collate_members_char.cc execution test
XPASS: 22_locale/collate_members_wchar_t.cc execution test
XPASS: 22_locale/ctype_is_char.cc execution test
XPASS: 22_locale/ctype_is_wchar_t.cc execution test
XPASS: 22_locale/members.cc execution test
XPASS: 22_locale/messages_byname.cc execution test
XPASS: 22_locale/messages_members_char.cc execution test
XPASS: 22_locale/money_get_members_char.cc execution test
XPASS: 22_locale/money_get_members_wchar_t.cc execution test
XPASS: 22_locale/money_put_members_char.cc execution test
XPASS: 22_locale/money_put_members_wchar_t.cc execution test
XPASS: 22_locale/moneypunct_byname.cc execution test
XPASS: 22_locale/moneypunct_members_char.cc execution test
XPASS: 22_locale/moneypunct_members_wchar_t.cc execution test
XPASS: 22_locale/num_get_members_char.cc execution test
XPASS: 22_locale/num_get_members_wchar_t.cc execution test
XPASS: 22_locale/num_put_members_char.cc execution test
XPASS: 22_locale/num_put_members_wchar_t.cc execution test
XPASS: 22_locale/numpunct_byname.cc execution test
XPASS: 22_locale/numpunct_members_char.cc execution test
XPASS: 22_locale/numpunct_members_wchar_t.cc execution test
XPASS: 22_locale/time_get_members_char.cc execution test
XPASS: 22_locale/time_get_members_wchar_t.cc execution test
XPASS: 22_locale/time_put_members_char.cc execution test
XPASS: 22_locale/time_put_members_wchar_t.cc execution test

		=== libstdc++-v3 Summary ===

# of expected passes		453
# of unexpected successes	26
# of expected failures		2

Compiler version: 3.3.2 20030831 (prerelease) 
Platform: powerpc-unknown-linux-gnu
configure flags: --host=powerpc-unknown-linux-gnu --prefix=/var/tmp
Andreas Tobler | 1 Sep 06:23 2003
Picon

Results for 3.3.2 20030831 (prerelease) testsuite on sparc-sun-solaris2.9


LAST_UPDATED: Sun Aug 31 12:21:03 UTC 2003

Native configuration is sparc-sun-solaris2.9

		=== g77 tests ===

Running target unix

		=== g77 Summary ===

# of expected passes		1686
# of unsupported tests		8
/opt/gcc/gcc-branch/objdir/gcc/testsuite/../g77 version 3.3.2 20030831 (prerelease)

		=== gcc tests ===

Running target unix
WARNING: gcc.dg/20021014-1.c compilation failed to produce executable
FAIL: gcc.dg/duff-2.c (test for excess errors)

		=== gcc Summary ===

# of expected passes		21355
# of unexpected failures	1
# of expected failures		67
# of unsupported tests		166
/opt/gcc/gcc-branch/objdir/gcc/xgcc version 3.3.2 20030831 (prerelease)

		=== g++ tests ===

Running target unix

		=== g++ Summary ===

# of expected passes		8042
# of expected failures		98
# of untested testcases		21
# of unsupported tests		26
/opt/gcc/gcc-branch/objdir/gcc/testsuite/../g++ version 3.3.2 20030831 (prerelease)

		=== objc tests ===

Running target unix

		=== objc Summary ===

# of expected passes		1153
/opt/gcc/gcc-branch/objdir/gcc/xgcc version 3.3.2 20030831 (prerelease)

		=== libjava tests ===

Running target unix
ERROR: tcl error sourcing /opt/gcc/gcc-branch/gcc/libjava/testsuite/libjava.compile/compile.exp.
ERROR: can't read "x": no such variable
FAIL: Array_3 execution - gij test
FAIL: Array_3 execution - gij test
FAIL: FileHandleGcTest execution - source compiled test
FAIL: FileHandleGcTest execution - bytecode->native test
FAIL: FileHandleGcTest -O execution - source compiled test
FAIL: FileHandleGcTest -O execution - bytecode->native test
WARNING: program timed out.
FAIL: SyncTest execution - gij test
FAIL: SyncTest execution - gij test
WARNING: program timed out.
FAIL: SyncTest -O execution - bytecode->native test
FAIL: Thread_Join execution - gij test
FAIL: Thread_Join execution - gij test
FAIL: Thread_Wait_2 execution - gij test
FAIL: Thread_Wait_2 execution - gij test
FAIL: Throw_2 execution - source compiled test
FAIL: Throw_2 execution - gij test
FAIL: Throw_2 execution - bytecode->native test
FAIL: Throw_2 -O execution - source compiled test
FAIL: Throw_2 execution - gij test
FAIL: Throw_2 -O execution - bytecode->native test
ERROR: No \`main' given in program final_inner
UNRESOLVED: final_inner -O compilation from source

		=== libjava Summary ===

# of expected passes		2485
# of unexpected failures	19
# of expected failures		8
# of unresolved testcases	1
# of untested testcases		23
		=== libstdc++-v3 tests ===

Running target unix

		=== libstdc++-v3 Summary ===

# of expected passes		429
# of expected failures		18

Compiler version: 3.3.2 20030831 (prerelease) 
Platform: sparc-sun-solaris2.9
configure flags: --host=sparc-sun-solaris2.9 --prefix=/var/tmp
Loren James Rittle | 1 Sep 07:35 2003
Picon

Results for 3.3.2 20030831 (prerelease) testsuite on alpha-unknown-freebsd5.1

Using gmake with srcdir configuration on beast (see key)

LAST_UPDATED: Sun Aug 31 20:52:52 GMT 2003

Native configuration is alpha-unknown-freebsd5.1

		=== libjava tests ===

Running target unix
FAIL: SyncTest execution - source compiled test
FAIL: SyncTest output - gij test
FAIL: SyncTest -O execution - source compiled test
FAIL: Thread_Monitor execution - gij test
FAIL: Thread_Monitor execution - bytecode->native test
FAIL: Thread_Monitor output - gij test
FAIL: Thread_Monitor -O execution - bytecode->native test
FAIL: Throw_2 execution - source compiled test
FAIL: Throw_2 execution - gij test
FAIL: Throw_2 execution - bytecode->native test
FAIL: Throw_2 -O execution - source compiled test
FAIL: Throw_2 execution - gij test
FAIL: Throw_2 -O execution - bytecode->native test
FAIL: initexc execution - gij test
FAIL: initexc execution - gij test

		=== libjava Summary ===

# of expected passes		2963
# of unexpected failures	15
# of expected failures		16
# of untested testcases		25
		=== libstdc++-v3 tests ===

Running target unix
FAIL: 18_support/numeric_limits.cc execution test
XPASS: 22_locale/ctype_is_wchar_t.cc execution test
FAIL: 27_io/filebuf_members.cc execution test

		=== libstdc++-v3 Summary ===

# of expected passes		451
# of unexpected failures	2
# of unexpected successes	1
# of expected failures		27
		=== g++ tests ===

Running target unix
FAIL: g++.dg/expr/anew1.C execution test
FAIL: g++.dg/expr/anew2.C execution test
FAIL: g++.dg/expr/anew3.C execution test
FAIL: g++.dg/expr/anew4.C execution test
FAIL: g++.dg/tls/init-2.C (test for excess errors)
FAIL: g++.law/profile1.C (test for excess errors)
FAIL: g++.pt/repo3.C (test for excess errors)

		=== g++ Summary ===

# of expected passes		8057
# of unexpected failures	7
# of expected failures		96
# of untested testcases		22
# of unsupported tests		27
/j/ljrittle/gcc-build-beast-0831-in/gcc/testsuite/../g++ version 3.3.2 20030831 (prerelease)

		=== g77 tests ===

Running target unix

		=== g77 Summary ===

# of expected passes		1686
# of unsupported tests		8
/j/ljrittle/gcc-build-beast-0831-in/gcc/testsuite/../g77 version 3.3.2 20030831 (prerelease)

		=== gcc tests ===

Running target unix
FAIL: gcc.c-torture/execute/20020227-1.c compilation,  -O0 
UNRESOLVED: gcc.c-torture/execute/20020227-1.c execution,  -O0 
FAIL: gcc.c-torture/execute/20020227-1.c compilation,  -O1 
UNRESOLVED: gcc.c-torture/execute/20020227-1.c execution,  -O1 
FAIL: gcc.c-torture/execute/20020227-1.c compilation,  -O2 
UNRESOLVED: gcc.c-torture/execute/20020227-1.c execution,  -O2 
FAIL: gcc.c-torture/execute/20020227-1.c compilation,  -O3 -fomit-frame-pointer 
UNRESOLVED: gcc.c-torture/execute/20020227-1.c execution,  -O3 -fomit-frame-pointer 
FAIL: gcc.c-torture/execute/20020227-1.c compilation,  -O3 -g 
UNRESOLVED: gcc.c-torture/execute/20020227-1.c execution,  -O3 -g 
FAIL: gcc.c-torture/execute/20020227-1.c compilation,  -Os 
UNRESOLVED: gcc.c-torture/execute/20020227-1.c execution,  -Os 
FAIL: gcc.c-torture/execute/simd-2.c compilation,  -O3 -fomit-frame-pointer 
UNRESOLVED: gcc.c-torture/execute/simd-2.c execution,  -O3 -fomit-frame-pointer 
FAIL: gcc.c-torture/execute/simd-2.c compilation,  -O3 -g 
UNRESOLVED: gcc.c-torture/execute/simd-2.c execution,  -O3 -g 
FAIL: gcc.dg/20020607-2.c (test for excess errors)
WARNING: gcc.dg/20020607-2.c compilation failed to produce executable
FAIL: gcc.dg/20021014-1.c (test for excess errors)
WARNING: gcc.dg/20021014-1.c compilation failed to produce executable
FAIL: gcc.dg/duff-2.c (test for excess errors)
FAIL: gcc.dg/fastmath-1.c (test for excess errors)
WARNING: gcc.dg/fastmath-1.c compilation failed to produce executable
FAIL: gcc.dg/fnegate-1.c (test for excess errors)
WARNING: gcc.dg/fnegate-1.c compilation failed to produce executable
FAIL: gcc.dg/nest.c (test for excess errors)
WARNING: gcc.dg/nest.c compilation failed to produce executable

		=== gcc Summary ===

# of expected passes		21360
# of unexpected failures	14
# of expected failures		72
# of unresolved testcases	8
# of unsupported tests		168
/j/ljrittle/gcc-build-beast-0831-in/gcc/xgcc version 3.3.2 20030831 (prerelease)

		=== objc tests ===

Running target unix
FAIL: objc/execute/class-13.m compilation,  -O3 -fomit-frame-pointer 
UNRESOLVED: objc/execute/class-13.m execution,  -O3 -fomit-frame-pointer 
FAIL: objc/execute/class-13.m compilation,  -O3 -g 
UNRESOLVED: objc/execute/class-13.m execution,  -O3 -g 
FAIL: objc/execute/class-6.m compilation,  -O3 -fomit-frame-pointer 
UNRESOLVED: objc/execute/class-6.m execution,  -O3 -fomit-frame-pointer 
FAIL: objc/execute/class-6.m compilation,  -O3 -g 
UNRESOLVED: objc/execute/class-6.m execution,  -O3 -g 
FAIL: objc/execute/object_is_class.m compilation,  -O3 -fomit-frame-pointer 
UNRESOLVED: objc/execute/object_is_class.m execution,  -O3 -fomit-frame-pointer 
FAIL: objc/execute/object_is_class.m compilation,  -O3 -g 
UNRESOLVED: objc/execute/object_is_class.m execution,  -O3 -g 
FAIL: objc/execute/object_is_meta_class.m compilation,  -O3 -fomit-frame-pointer 
UNRESOLVED: objc/execute/object_is_meta_class.m execution,  -O3 -fomit-frame-pointer 
FAIL: objc/execute/object_is_meta_class.m compilation,  -O3 -g 
UNRESOLVED: objc/execute/object_is_meta_class.m execution,  -O3 -g 

		=== objc Summary ===

# of expected passes		1137
# of unexpected failures	8
# of unresolved testcases	8
/j/ljrittle/gcc-build-beast-0831-in/gcc/xgcc version 3.3.2 20030831 (prerelease)

Compiler version: 3.3.2 20030831 (prerelease) 
Platform: alpha-unknown-freebsd5.1
configure flags: --host=alpha-unknown-freebsd5.1
--prefix=/home/ljrittle/beast/tmp/install-beast --with-gnu-as --with-as=/usr/bin/as
--with-gnu-ld --with-ld=/usr/bin/ld
BOOT_CFLAGS=-g -O2
Key: gmake is GNU make
     make is BSD make as shipped on alpha-unknown-freebsd5.1
     srcdir means in-source configuration was done within the gcc source tree
     objdir means out-source configuration was done within a fresh directory
ref4 (3.3) and ref5 (mainline) attempt to build gcc twice daily;
once for srcdir configuration and once for objdir configuration;
odd number days use GNU make; even days use BSD make; missing
reports infer breakage; partial reports are made when bootstap
completes in gcc but fails in a support library.
beast (3.3) builds gcc once daily using gmake with objdir conf.
See http://people.freebsd.org/~ljrittle/daily-gcc-bootstrap-reports
for all related transcript logs and log.sent files (not staged
until after all daily bootstraps for a machine complete).

jeroen.dobbelaere | 1 Sep 12:23 2003

Results for 3.3.2 20030831 (prerelease) testsuite on armv5l-unknown-linux-gnu

kernel : 2.4.16-rmk1-xng1
binutils-2.14.90.0.4 + 'default float on arm-linux' patch
glibc-2.2.5 + arm patch

LAST_UPDATED: Mon Sep  1 00:13:41 UTC 2003

Native configuration is armv5l-unknown-linux-gnu

		=== libstdc++-v3 tests ===

Running target unix
XPASS: 22_locale/ctype_is_wchar_t.cc execution test

		=== libstdc++-v3 Summary ===

# of expected passes		453
# of unexpected successes	1
# of expected failures		27
		=== g++ tests ===

Running target unix
FAIL: g++.dg/abi/empty6.C  (test for warnings, line 6)
FAIL: g++.dg/abi/vbase10.C  (test for warnings, line 6)
FAIL: g++.dg/expr/anew1.C execution test
FAIL: g++.dg/expr/anew2.C execution test
FAIL: g++.dg/expr/anew3.C execution test
FAIL: 258: expected branch percentages not found: 25
FAIL: g++.dg/gcov/gcov-1.C gcov: 0 failures in line counts, 1 in branch percentages, 0 in return percentages

		=== g++ Summary ===

# of expected passes		8033
# of unexpected failures	7
# of expected failures		95
# of untested testcases		23
# of unsupported tests		28
/usr/src/cvs-others/gcc-trees/gcc-3.3-branch/build-tmp-0/gcc/testsuite/../g++ version 3.3.2
20030831 (prerelease)

		=== g77 tests ===

Running target unix

		=== g77 Summary ===

# of expected passes		1686
# of unsupported tests		8
/usr/src/cvs-others/gcc-trees/gcc-3.3-branch/build-tmp-0/gcc/testsuite/../g77 version 3.3.2
20030831 (prerelease)

		=== gcc tests ===

Running target unix
WARNING: program timed out.
FAIL: gcc.c-torture/compile/20001226-1.c,  -O3 -g  
XPASS: gcc.c-torture/execute/20020720-1.c compilation,  -O1 
XPASS: gcc.c-torture/execute/20020720-1.c compilation,  -O2 
XPASS: gcc.c-torture/execute/20020720-1.c compilation,  -O3 -fomit-frame-pointer 
XPASS: gcc.c-torture/execute/20020720-1.c compilation,  -O3 -g 
XPASS: gcc.c-torture/execute/20020720-1.c compilation,  -Os 
FAIL: gcc.dg/20021014-1.c execution test
FAIL: gcc.dg/duff-2.c (test for excess errors)
FAIL: gcc.dg/nest.c execution test
FAIL: gcc.dg/pack-test-1.c (test for excess errors)
FAIL: gcc.dg/pack-test-2.c  (test for errors, line 7)
FAIL: gcc.dg/pack-test-2.c  (test for errors, line 14)
FAIL: gcc.dg/pack-test-2.c  (test for errors, line 19)
FAIL: gcc.dg/pack-test-2.c (test for excess errors)
FAIL: gcc.dg/format/warnll-1.c scanf %LX (test for warnings, line 44)
FAIL: gcc.dg/format/warnll-1.c (test for excess errors)
FAIL: gcc.dg/noncompile/voidparam-1.c (test for excess errors)
FAIL: 209: expected branch percentages not found: 25
FAIL: gcc.misc-tests/gcov-4b.c gcov: 0 failures in line counts, 1 in branch percentages, 0 in return percentages

		=== gcc Summary ===

# of expected passes		20878
# of unexpected failures	14
# of unexpected successes	5
# of expected failures		69
# of unsupported tests		176
/usr/src/cvs-others/gcc-trees/gcc-3.3-branch/build-tmp-0/gcc/xgcc version 3.3.2 20030831 (prerelease)

		=== objc tests ===

Running target unix

		=== objc Summary ===

# of expected passes		1153
/usr/src/cvs-others/gcc-trees/gcc-3.3-branch/build-tmp-0/gcc/xgcc version 3.3.2 20030831 (prerelease)

Compiler version: 3.3.2 20030831 (prerelease) 
Platform: armv5l-unknown-linux-gnu
configure flags: --host=armv5l-unknown-linux-gnu --prefix=/usr/local/gcc-3.3-cvs
--with-cpu=xscale --enable-languages=c,c++,f77,objc,java

Andreas Schwab | 1 Sep 12:43 2003
Picon

Results for 3.3.2 20030901 (prerelease) testsuite on ia64-suse-linux-gnu

LAST_UPDATED: Mon Sep  1 08:06:19 UTC 2003

Native configuration is ia64-suse-linux-gnu

		=== g++ tests ===

Running target unix
FAIL: g++.dg/tls/init-2.C (test for excess errors)

		=== g++ Summary ===

# of expected passes		7828
# of unexpected failures	1
# of expected failures		95
# of untested testcases		23
# of unsupported tests		27
/tmp/cvs/gcc-20030901/Build/gcc/testsuite/../g++ version 3.3.2 20030901 (prerelease)

		=== g77 tests ===

Running target unix

		=== g77 Summary ===

# of expected passes		1686
# of unsupported tests		8
/tmp/cvs/gcc-20030901/Build/gcc/testsuite/../g77 version 3.3.2 20030901 (prerelease)

		=== gcc tests ===

Running target unix
XPASS: gcc.c-torture/compile/981223-1.c,  -O2  
XPASS: gcc.c-torture/compile/981223-1.c,  -O3 -fomit-frame-pointer  
XPASS: gcc.c-torture/compile/981223-1.c,  -O3 -g  
XPASS: gcc.c-torture/compile/981223-1.c,  -Os  
FAIL: gcc.c-torture/compile/930117-1.c,  -O1  
FAIL: gcc.c-torture/compile/930117-1.c,  -O2  
FAIL: gcc.c-torture/compile/930117-1.c,  -O3 -fomit-frame-pointer  
FAIL: gcc.c-torture/compile/930117-1.c,  -O3 -g  
FAIL: gcc.c-torture/compile/930117-1.c,  -Os  
XPASS: gcc.c-torture/execute/20020227-1.c execution,  -O0 
FAIL: gcc.c-torture/execute/20020227-1.c compilation,  -O2 
UNRESOLVED: gcc.c-torture/execute/20020227-1.c execution,  -O2 
FAIL: gcc.c-torture/execute/20020227-1.c compilation,  -O3 -fomit-frame-pointer 
UNRESOLVED: gcc.c-torture/execute/20020227-1.c execution,  -O3 -fomit-frame-pointer 
FAIL: gcc.c-torture/execute/20020227-1.c compilation,  -O3 -g 
UNRESOLVED: gcc.c-torture/execute/20020227-1.c execution,  -O3 -g 
FAIL: gcc.c-torture/execute/20020227-1.c compilation,  -Os 
UNRESOLVED: gcc.c-torture/execute/20020227-1.c execution,  -Os 
FAIL: gcc.dg/duff-2.c (test for excess errors)

		=== gcc Summary ===

# of expected passes		20585
# of unexpected failures	10
# of unexpected successes	5
# of expected failures		78
# of unresolved testcases	4
# of unsupported tests		166
/tmp/cvs/gcc-20030901/Build/gcc/xgcc version 3.3.2 20030901 (prerelease)

		=== objc tests ===

Running target unix

		=== objc Summary ===

# of expected passes		1153
/tmp/cvs/gcc-20030901/Build/gcc/xgcc version 3.3.2 20030901 (prerelease)

		=== libjava tests ===

Running target unix
FAIL: Thread_Join execution - gij test

		=== libjava Summary ===

# of expected passes		2989
# of unexpected failures	1
# of expected failures		16
# of untested testcases		13
		=== libstdc++-v3 tests ===

Running target unix
XPASS: 22_locale/collate_byname.cc execution test
XPASS: 22_locale/collate_members_char.cc execution test
XPASS: 22_locale/collate_members_wchar_t.cc execution test
XPASS: 22_locale/ctype_is_char.cc execution test
XPASS: 22_locale/ctype_is_wchar_t.cc execution test
XPASS: 22_locale/members.cc execution test
XPASS: 22_locale/messages_byname.cc execution test
XPASS: 22_locale/messages_members_char.cc execution test
XPASS: 22_locale/money_get_members_char.cc execution test
XPASS: 22_locale/money_get_members_wchar_t.cc execution test
XPASS: 22_locale/money_put_members_char.cc execution test
XPASS: 22_locale/money_put_members_wchar_t.cc execution test
XPASS: 22_locale/moneypunct_byname.cc execution test
XPASS: 22_locale/moneypunct_members_char.cc execution test
XPASS: 22_locale/moneypunct_members_wchar_t.cc execution test
XPASS: 22_locale/num_get_members_char.cc execution test
XPASS: 22_locale/num_get_members_wchar_t.cc execution test
XPASS: 22_locale/num_put_members_char.cc execution test
XPASS: 22_locale/numpunct_byname.cc execution test
XPASS: 22_locale/numpunct_members_char.cc execution test
XPASS: 22_locale/numpunct_members_wchar_t.cc execution test
XPASS: 22_locale/time_get_members_char.cc execution test
XPASS: 22_locale/time_get_members_wchar_t.cc execution test
XPASS: 22_locale/time_put_members_char.cc execution test
XPASS: 22_locale/time_put_members_wchar_t.cc execution test
FAIL: 25_algorithms/sort.cc (test for excess errors)

		=== libstdc++-v3 Summary ===

# of expected passes		452
# of unexpected failures	1
# of unexpected successes	25
# of expected failures		3

Compiler version: 3.3.2 20030901 (prerelease) 
Platform: ia64-suse-linux-gnu
configure flags: --host=ia64-suse-linux --enable-shared --enable-threads --with-system-zlib

Autocrasher | 1 Sep 16:00 2003

Results for [rtl] 3.3.220030901(prerelease) testsuite on i686-pc-linux-gnu


The configure/build/test log and libstdc++-v3 regression plots can be
found at http://www.devphil.com/build/

Host was specified as athlon_mp-pc-linux-gnu.

This particular run used standard (previously installed) binutils.

- The Autocrasher (Phil's Builder Bot, version 2.0)

LAST_UPDATED: Wed Jul  9 21:54:50 UTC 2003

Native configuration is i686-pc-linux-gnu

		=== g++ tests ===

Running target unix
FAIL: g++.dg/tls/init-2.C (test for excess errors)
FAIL: g++.other/decl5.C caused compiler crash
XPASS: g++.other/init5.C  Execution test

		=== g++ Summary ===

# of expected passes		8102
# of unexpected failures	2
# of unexpected successes	1
# of expected failures		88
# of untested testcases		9
# of unsupported tests		14
/mnt/build/build-2003-09-01-rtl/gcc/testsuite/../g++ version 3.3.2 20030901 (prerelease)

		=== libstdc++-v3 check-abi Summary ===

# of added symbols:		 0
# of missing symbols:		 0
# of incompatible symbols:	 0
		=== libstdc++-v3 tests ===

Running target unix
XPASS: 22_locale/collate_byname.cc execution test
XPASS: 22_locale/collate_members_char.cc execution test
XPASS: 22_locale/collate_members_wchar_t.cc execution test
XPASS: 22_locale/ctype_is_char.cc execution test
XPASS: 22_locale/ctype_is_wchar_t.cc execution test
XPASS: 22_locale/members.cc execution test
XPASS: 22_locale/messages_byname.cc execution test
XPASS: 22_locale/messages_members_char.cc execution test
XPASS: 22_locale/money_get_members_char.cc execution test
XPASS: 22_locale/money_get_members_wchar_t.cc execution test
XPASS: 22_locale/money_put_members_char.cc execution test
XPASS: 22_locale/money_put_members_wchar_t.cc execution test
XPASS: 22_locale/moneypunct_byname.cc execution test
XPASS: 22_locale/moneypunct_members_char.cc execution test
XPASS: 22_locale/moneypunct_members_wchar_t.cc execution test
XPASS: 22_locale/num_get_members_char.cc execution test
XPASS: 22_locale/num_get_members_wchar_t.cc execution test
XPASS: 22_locale/num_put_members_char.cc execution test
XPASS: 22_locale/num_put_members_wchar_t.cc execution test
XPASS: 22_locale/numpunct_byname.cc execution test
XPASS: 22_locale/numpunct_members_char.cc execution test
XPASS: 22_locale/numpunct_members_wchar_t.cc execution test
XPASS: 22_locale/time_get_members_char.cc execution test
XPASS: 22_locale/time_get_members_wchar_t.cc execution test

		=== libstdc++-v3 Summary ===

# of expected passes		453
# of unexpected successes	24
# of expected failures		4

Compiler version: 3.3.220030901(prerelease) 
Platform: i686-pc-linux-gnu
configure flags: --host=i686-pc-linux-gnu --prefix=/mnt/build/install-2003-09-01-rtl
--enable-threads=posix --enable-__cxa_atexit --enable-languages=c++ --with-dwarf2 --enable-checking=misc,tree,gc,rtl,rtlflag


Gmane