jeroen.dobbelaere | 1 Aug 01:35 2003

Results for 3.3.1 20030731 (prerelease) testsuite on armv5l-unknown-linux-gnu

kernel : 2.4.16-rmk1-xng1
binutils-2.14.90.0.4 + 'default float on arm-linux' patch
glibc-2.2.5 + arm patch

LAST_UPDATED: Thu Jul 31 13:34:08 UTC 2003

Native configuration is armv5l-unknown-linux-gnu

		=== libstdc++-v3 tests ===

Running target unix
XPASS: 22_locale/ctype_is_wchar_t.cc execution test

		=== libstdc++-v3 Summary ===

# of expected passes		453
# of unexpected successes	1
# of expected failures		27
		=== g++ tests ===

Running target unix
FAIL: g++.dg/abi/empty6.C  (test for warnings, line 6)
FAIL: g++.dg/abi/vbase10.C  (test for warnings, line 6)
FAIL: g++.dg/expr/anew1.C execution test
FAIL: g++.dg/expr/anew2.C execution test
FAIL: g++.dg/expr/anew3.C execution test
FAIL: g++.dg/template/recurse.C (test for excess errors)
FAIL: 258: expected branch percentages not found: 25
FAIL: g++.dg/gcov/gcov-1.C gcov: 0 failures in line counts, 1 in branch percentages, 0 in return percentages

(Continue reading)

Robert Schiele | 1 Aug 01:38 2003
Picon

Results for 3.3.1 20030731 (prerelease) testsuite on i586-suse-linux-gnu

Attachment: application/octet-stream, 3255 bytes
regress | 1 Aug 01:25 2003
Picon

Results for 3.4 20030731 (experimental) testsuite on powerpc-apple-darwin6.3

LAST_UPDATED: 
Native configuration is powerpc-apple-darwin6.3

		=== g++ tests ===

Running target unix
FAIL: g++.dg/eh/cleanup1.C (test for excess errors)
FAIL: g++.dg/eh/simd-2.C (test for excess errors)
WARNING: g++.dg/eh/simd-2.C compilation failed to produce executable
FAIL: g++.dg/ext/pretty1.C scan-assembler top level
FAIL: g++.dg/ext/pretty2.C (test for excess errors)
WARNING: g++.dg/ext/pretty2.C compilation failed to produce executable
FAIL: g++.dg/init/array10.C (test for excess errors)
FAIL: g++.dg/init/init-ref4.C (test for excess errors)
WARNING: g++.dg/init/init-ref4.C compilation failed to produce executable
XPASS: g++.dg/other/packed1.C execution test
FAIL: g++.dg/parse/attr-ctor1.C (test for excess errors)
FAIL: g++.dg/parse/stack1.C (test for excess errors)
FAIL: g++.dg/template/explicit-instantiation2.C scan-assembler _Z1fIiET_S0_
FAIL: g++.dg/template/inline1.C scan-assembler-not _ZN1X3FooIiEEvT_:
FAIL: g++.dg/template/non-dependent2.C (test for excess errors)
FAIL: g++.dg/template/non-dependent3.C (test for excess errors)
FAIL: g++.dg/warn/weak1.C (test for excess errors)
FAIL: g++.dg/special/conpr-3.C execution test
FAIL: g++.old-deja/g++.eh/badalloc1.C (test for excess errors)
XPASS: g++.old-deja/g++.eh/badalloc1.C execution test
FAIL: g++.old-deja/g++.ext/attrib5.C (test for excess errors)
WARNING: g++.old-deja/g++.ext/attrib5.C compilation failed to produce executable
WARNING: g++.old-deja/g++.mike/p10769a.C compilation failed to produce executable
FAIL: g++.old-deja/g++.mike/p4750.C (test for excess errors)
FAIL: g++.old-deja/g++.other/comdat3.C (test for excess errors)
WARNING: g++.old-deja/g++.other/comdat3.C compilation failed to produce executable
FAIL: g++.old-deja/g++.other/crash18.C (test for excess errors)
WARNING: g++.old-deja/g++.other/enum5.C compilation failed to produce executable
FAIL: g++.old-deja/g++.other/local-alloc1.C (test for excess errors)
FAIL: g++.old-deja/g++.other/mangle3.C (test for excess errors)
WARNING: g++.old-deja/g++.pt/friend44.C compilation failed to produce executable
FAIL: g++.old-deja/g++.pt/static3.C (test for excess errors)
WARNING: g++.old-deja/g++.pt/static3.C compilation failed to produce executable
FAIL: g++.old-deja/g++.pt/static6.C (test for excess errors)

		=== g++ Summary ===

# of expected passes		8611
# of unexpected failures	23
# of unexpected successes	2
# of expected failures		67
# of unsupported tests		56
/Users/regress/tbox/native/build/gcc/testsuite/../g++ version 3.4 20030731 (experimental)

		=== g77 tests ===

Running target unix
FAIL: g77.f-torture/execute/980520-1.f compilation,  -O0 

		=== g77 Summary ===

# of expected passes		1746
# of unexpected failures	1
# of untested testcases		1
# of unsupported tests		6
/Users/regress/tbox/native/build/gcc/testsuite/../g77 version 3.4 20030731 (experimental)

		=== gcc tests ===

Running target unix
WARNING: program timed out.
FAIL: gcc.c-torture/compile/20001226-1.c (test for excess errors)
FAIL: gcc.c-torture/execute/pure-1.c compilation,  -O1 
UNRESOLVED: gcc.c-torture/execute/pure-1.c execution,  -O1 
FAIL: gcc.c-torture/execute/pure-1.c compilation,  -O2 
UNRESOLVED: gcc.c-torture/execute/pure-1.c execution,  -O2 
FAIL: gcc.c-torture/execute/pure-1.c compilation,  -Os 
UNRESOLVED: gcc.c-torture/execute/pure-1.c execution,  -Os 
UNRESOLVED: gcc.c-torture/execute/wchar_t-1.c execution,  -O0 
UNRESOLVED: gcc.c-torture/execute/wchar_t-1.c execution,  -O1 
UNRESOLVED: gcc.c-torture/execute/wchar_t-1.c execution,  -O2 
UNRESOLVED: gcc.c-torture/execute/wchar_t-1.c execution,  -O3 -fomit-frame-pointer 
UNRESOLVED: gcc.c-torture/execute/wchar_t-1.c execution,  -O3 -g 
UNRESOLVED: gcc.c-torture/execute/wchar_t-1.c execution,  -Os 
FAIL: gcc.dg/compat/struct-by-value-1 c_compat_x_tst.o-c_compat_y_tst.o link
UNRESOLVED: gcc.dg/compat/struct-by-value-1 c_compat_x_tst.o-c_compat_y_tst.o execute 
FAIL: gcc.dg/compat/struct-by-value-2 c_compat_x_tst.o-c_compat_y_tst.o link
UNRESOLVED: gcc.dg/compat/struct-by-value-2 c_compat_x_tst.o-c_compat_y_tst.o execute 
FAIL: gcc.dg/compat/struct-by-value-4 c_compat_x_tst.o-c_compat_y_tst.o link
UNRESOLVED: gcc.dg/compat/struct-by-value-4 c_compat_x_tst.o-c_compat_y_tst.o execute 
FAIL: gcc.dg/compat/struct-by-value-8 c_compat_x_tst.o-c_compat_y_tst.o link
UNRESOLVED: gcc.dg/compat/struct-by-value-8 c_compat_x_tst.o-c_compat_y_tst.o execute 
FAIL: gcc.dg/compat/struct-by-value-9 c_compat_x_tst.o-c_compat_y_tst.o link
UNRESOLVED: gcc.dg/compat/struct-by-value-9 c_compat_x_tst.o-c_compat_y_tst.o execute 
FAIL: gcc.dg/compat/struct-return-2 c_compat_x_tst.o-c_compat_y_tst.o link
UNRESOLVED: gcc.dg/compat/struct-return-2 c_compat_x_tst.o-c_compat_y_tst.o execute 
FAIL: gcc.dg/compat/vector-1 c_compat_x_tst.o compile
FAIL: gcc.dg/compat/vector-1 c_compat_y_tst.o compile
UNRESOLVED: gcc.dg/compat/vector-1 c_compat_x_tst.o-c_compat_y_tst.o link 
UNRESOLVED: gcc.dg/compat/vector-1 c_compat_x_tst.o-c_compat_y_tst.o execute 
FAIL: gcc.dg/compat/vector-2 c_compat_x_tst.o compile
FAIL: gcc.dg/compat/vector-2 c_compat_y_tst.o compile
UNRESOLVED: gcc.dg/compat/vector-2 c_compat_x_tst.o-c_compat_y_tst.o link 
UNRESOLVED: gcc.dg/compat/vector-2 c_compat_x_tst.o-c_compat_y_tst.o execute 
FAIL: gcc.dg/20020425-1.c (test for excess errors)
FAIL: gcc.dg/asm-names.c (test for excess errors)
FAIL: gcc.dg/builtins-18.c (test for excess errors)
FAIL: gcc.dg/builtins-20.c (test for excess errors)
FAIL: gcc.dg/c90-intconst-1.c (test for excess errors)
FAIL: gcc.dg/c99-intconst-1.c (test for excess errors)
FAIL: gcc.dg/const-elim-1.c scan-assembler-not L\\\$?C[^A-Z]
FAIL: gcc.dg/struct-by-value-1.c (test for excess errors)
WARNING: gcc.dg/struct-by-value-1.c compilation failed to produce executable
UNRESOLVED: gcc.dg/special/weak-1.c
UNRESOLVED: gcc.dg/special/weak-2.c
UNRESOLVED: gcc.dg/special/wkali-1.c
UNRESOLVED: gcc.dg/special/wkali-2.c
FAIL: gcc.dg/torture/builtin-noret-1.c (test for excess errors)
FAIL: gcc.dg/torture/builtin-noret-1.c (test for excess errors)
FAIL: gcc.dg/torture/builtin-noret-1.c (test for excess errors)
FAIL: gcc.dg/torture/builtin-noret-1.c (test for excess errors)
FAIL: gcc.dg/torture/builtin-noret-1.c (test for excess errors)
FAIL: gcc.dg/torture/builtin-noret-1.c (test for excess errors)
FAIL: gcc.dg/torture/builtin-noret-2.c (test for excess errors)
FAIL: gcc.dg/torture/builtin-noret-2.c (test for excess errors)
FAIL: gcc.dg/torture/builtin-noret-2.c (test for excess errors)
FAIL: gcc.dg/torture/builtin-noret-2.c (test for excess errors)
FAIL: gcc.dg/torture/builtin-noret-2.c (test for excess errors)
FAIL: gcc.dg/torture/builtin-noret-2.c (test for excess errors)
UNRESOLVED: gcc.dg/weak/typeof-2.c
UNRESOLVED: gcc.dg/weak/weak-1.c
UNRESOLVED: gcc.dg/weak/weak-2.c
UNRESOLVED: gcc.dg/weak/weak-3.c
UNRESOLVED: gcc.dg/weak/weak-4.c
UNRESOLVED: gcc.dg/weak/weak-5.c
UNRESOLVED: gcc.dg/weak/weak-6.c
UNRESOLVED: gcc.dg/weak/weak-7.c
UNRESOLVED: gcc.dg/weak/weak-8.c
UNRESOLVED: gcc.dg/weak/weak-9.c
FAIL: gcc.misc-tests/mg.c

		=== gcc Summary ===

# of expected passes		23415
# of unexpected failures	35
# of expected failures		81
# of unresolved testcases	33
# of unsupported tests		260
/Users/regress/tbox/native/build/gcc/xgcc version 3.4 20030731 (experimental)

		=== objc tests ===

Running target unix
FAIL: objc/execute/IMP.m compilation,  -O0 
UNRESOLVED: objc/execute/IMP.m execution,  -O0 
FAIL: objc/execute/IMP.m compilation,  -O1 
UNRESOLVED: objc/execute/IMP.m execution,  -O1 
FAIL: objc/execute/IMP.m compilation,  -O2 
UNRESOLVED: objc/execute/IMP.m execution,  -O2 
FAIL: objc/execute/IMP.m compilation,  -O3 -fomit-frame-pointer 
UNRESOLVED: objc/execute/IMP.m execution,  -O3 -fomit-frame-pointer 
FAIL: objc/execute/IMP.m compilation,  -O3 -g 
UNRESOLVED: objc/execute/IMP.m execution,  -O3 -g 
FAIL: objc/execute/IMP.m compilation,  -Os 
UNRESOLVED: objc/execute/IMP.m execution,  -Os 
FAIL: objc/execute/_cmd.m compilation,  -O0 
UNRESOLVED: objc/execute/_cmd.m execution,  -O0 
FAIL: objc/execute/_cmd.m compilation,  -O1 
UNRESOLVED: objc/execute/_cmd.m execution,  -O1 
FAIL: objc/execute/_cmd.m compilation,  -O2 
UNRESOLVED: objc/execute/_cmd.m execution,  -O2 
FAIL: objc/execute/_cmd.m compilation,  -O3 -fomit-frame-pointer 
UNRESOLVED: objc/execute/_cmd.m execution,  -O3 -fomit-frame-pointer 
FAIL: objc/execute/_cmd.m compilation,  -O3 -g 
UNRESOLVED: objc/execute/_cmd.m execution,  -O3 -g 
FAIL: objc/execute/_cmd.m compilation,  -Os 
UNRESOLVED: objc/execute/_cmd.m execution,  -Os 
FAIL: objc/execute/bf-1.m compilation,  -O0 
UNRESOLVED: objc/execute/bf-1.m execution,  -O0 
FAIL: objc/execute/bf-1.m compilation,  -O1 
UNRESOLVED: objc/execute/bf-1.m execution,  -O1 
FAIL: objc/execute/bf-1.m compilation,  -O2 
UNRESOLVED: objc/execute/bf-1.m execution,  -O2 
FAIL: objc/execute/bf-1.m compilation,  -O3 -fomit-frame-pointer 
UNRESOLVED: objc/execute/bf-1.m execution,  -O3 -fomit-frame-pointer 
FAIL: objc/execute/bf-1.m compilation,  -O3 -g 
UNRESOLVED: objc/execute/bf-1.m execution,  -O3 -g 
FAIL: objc/execute/bf-1.m compilation,  -Os 
UNRESOLVED: objc/execute/bf-1.m execution,  -Os 
FAIL: objc/execute/bf-10.m compilation,  -O0 
UNRESOLVED: objc/execute/bf-10.m execution,  -O0 
FAIL: objc/execute/bf-10.m compilation,  -O1 
UNRESOLVED: objc/execute/bf-10.m execution,  -O1 
FAIL: objc/execute/bf-10.m compilation,  -O2 
UNRESOLVED: objc/execute/bf-10.m execution,  -O2 
FAIL: objc/execute/bf-10.m compilation,  -O3 -fomit-frame-pointer 
UNRESOLVED: objc/execute/bf-10.m execution,  -O3 -fomit-frame-pointer 
FAIL: objc/execute/bf-10.m compilation,  -O3 -g 
UNRESOLVED: objc/execute/bf-10.m execution,  -O3 -g 
FAIL: objc/execute/bf-10.m compilation,  -Os 
UNRESOLVED: objc/execute/bf-10.m execution,  -Os 
FAIL: objc/execute/bf-11.m compilation,  -O0 
UNRESOLVED: objc/execute/bf-11.m execution,  -O0 
FAIL: objc/execute/bf-11.m compilation,  -O1 
UNRESOLVED: objc/execute/bf-11.m execution,  -O1 
FAIL: objc/execute/bf-11.m compilation,  -O2 
UNRESOLVED: objc/execute/bf-11.m execution,  -O2 
FAIL: objc/execute/bf-11.m compilation,  -O3 -fomit-frame-pointer 
UNRESOLVED: objc/execute/bf-11.m execution,  -O3 -fomit-frame-pointer 
FAIL: objc/execute/bf-11.m compilation,  -O3 -g 
UNRESOLVED: objc/execute/bf-11.m execution,  -O3 -g 
FAIL: objc/execute/bf-11.m compilation,  -Os 
UNRESOLVED: objc/execute/bf-11.m execution,  -Os 
FAIL: objc/execute/bf-12.m compilation,  -O0 
UNRESOLVED: objc/execute/bf-12.m execution,  -O0 
FAIL: objc/execute/bf-12.m compilation,  -O1 
UNRESOLVED: objc/execute/bf-12.m execution,  -O1 
FAIL: objc/execute/bf-12.m compilation,  -O2 
UNRESOLVED: objc/execute/bf-12.m execution,  -O2 
FAIL: objc/execute/bf-12.m compilation,  -O3 -fomit-frame-pointer 
UNRESOLVED: objc/execute/bf-12.m execution,  -O3 -fomit-frame-pointer 
FAIL: objc/execute/bf-12.m compilation,  -O3 -g 
UNRESOLVED: objc/execute/bf-12.m execution,  -O3 -g 
FAIL: objc/execute/bf-12.m compilation,  -Os 
UNRESOLVED: objc/execute/bf-12.m execution,  -Os 
FAIL: objc/execute/bf-13.m compilation,  -O0 
UNRESOLVED: objc/execute/bf-13.m execution,  -O0 
FAIL: objc/execute/bf-13.m compilation,  -O1 
UNRESOLVED: objc/execute/bf-13.m execution,  -O1 
FAIL: objc/execute/bf-13.m compilation,  -O2 
UNRESOLVED: objc/execute/bf-13.m execution,  -O2 
FAIL: objc/execute/bf-13.m compilation,  -O3 -fomit-frame-pointer 
UNRESOLVED: objc/execute/bf-13.m execution,  -O3 -fomit-frame-pointer 
FAIL: objc/execute/bf-13.m compilation,  -O3 -g 
UNRESOLVED: objc/execute/bf-13.m execution,  -O3 -g 
FAIL: objc/execute/bf-13.m compilation,  -Os 
UNRESOLVED: objc/execute/bf-13.m execution,  -Os 
FAIL: objc/execute/bf-14.m compilation,  -O0 
UNRESOLVED: objc/execute/bf-14.m execution,  -O0 
FAIL: objc/execute/bf-14.m compilation,  -O1 
UNRESOLVED: objc/execute/bf-14.m execution,  -O1 
FAIL: objc/execute/bf-14.m compilation,  -O2 
UNRESOLVED: objc/execute/bf-14.m execution,  -O2 
FAIL: objc/execute/bf-14.m compilation,  -O3 -fomit-frame-pointer 
UNRESOLVED: objc/execute/bf-14.m execution,  -O3 -fomit-frame-pointer 
FAIL: objc/execute/bf-14.m compilation,  -O3 -g 
UNRESOLVED: objc/execute/bf-14.m execution,  -O3 -g 
FAIL: objc/execute/bf-14.m compilation,  -Os 
UNRESOLVED: objc/execute/bf-14.m execution,  -Os 
FAIL: objc/execute/bf-15.m compilation,  -O0 
UNRESOLVED: objc/execute/bf-15.m execution,  -O0 
FAIL: objc/execute/bf-15.m compilation,  -O1 
UNRESOLVED: objc/execute/bf-15.m execution,  -O1 
FAIL: objc/execute/bf-15.m compilation,  -O2 
UNRESOLVED: objc/execute/bf-15.m execution,  -O2 
FAIL: objc/execute/bf-15.m compilation,  -O3 -fomit-frame-pointer 
UNRESOLVED: objc/execute/bf-15.m execution,  -O3 -fomit-frame-pointer 
FAIL: objc/execute/bf-15.m compilation,  -O3 -g 
UNRESOLVED: objc/execute/bf-15.m execution,  -O3 -g 
FAIL: objc/execute/bf-15.m compilation,  -Os 
UNRESOLVED: objc/execute/bf-15.m execution,  -Os 
FAIL: objc/execute/bf-16.m compilation,  -O0 
UNRESOLVED: objc/execute/bf-16.m execution,  -O0 
FAIL: objc/execute/bf-16.m compilation,  -O1 
UNRESOLVED: objc/execute/bf-16.m execution,  -O1 
FAIL: objc/execute/bf-16.m compilation,  -O2 
UNRESOLVED: objc/execute/bf-16.m execution,  -O2 
FAIL: objc/execute/bf-16.m compilation,  -O3 -fomit-frame-pointer 
UNRESOLVED: objc/execute/bf-16.m execution,  -O3 -fomit-frame-pointer 
FAIL: objc/execute/bf-16.m compilation,  -O3 -g 
UNRESOLVED: objc/execute/bf-16.m execution,  -O3 -g 
FAIL: objc/execute/bf-16.m compilation,  -Os 
UNRESOLVED: objc/execute/bf-16.m execution,  -Os 
FAIL: objc/execute/bf-17.m compilation,  -O0 
UNRESOLVED: objc/execute/bf-17.m execution,  -O0 
FAIL: objc/execute/bf-17.m compilation,  -O1 
UNRESOLVED: objc/execute/bf-17.m execution,  -O1 
FAIL: objc/execute/bf-17.m compilation,  -O2 
UNRESOLVED: objc/execute/bf-17.m execution,  -O2 
FAIL: objc/execute/bf-17.m compilation,  -O3 -fomit-frame-pointer 
UNRESOLVED: objc/execute/bf-17.m execution,  -O3 -fomit-frame-pointer 
FAIL: objc/execute/bf-17.m compilation,  -O3 -g 
UNRESOLVED: objc/execute/bf-17.m execution,  -O3 -g 
FAIL: objc/execute/bf-17.m compilation,  -Os 
UNRESOLVED: objc/execute/bf-17.m execution,  -Os 
FAIL: objc/execute/bf-18.m compilation,  -O0 
UNRESOLVED: objc/execute/bf-18.m execution,  -O0 
FAIL: objc/execute/bf-18.m compilation,  -O1 
UNRESOLVED: objc/execute/bf-18.m execution,  -O1 
FAIL: objc/execute/bf-18.m compilation,  -O2 
UNRESOLVED: objc/execute/bf-18.m execution,  -O2 
FAIL: objc/execute/bf-18.m compilation,  -O3 -fomit-frame-pointer 
UNRESOLVED: objc/execute/bf-18.m execution,  -O3 -fomit-frame-pointer 
FAIL: objc/execute/bf-18.m compilation,  -O3 -g 
UNRESOLVED: objc/execute/bf-18.m execution,  -O3 -g 
FAIL: objc/execute/bf-18.m compilation,  -Os 
UNRESOLVED: objc/execute/bf-18.m execution,  -Os 
FAIL: objc/execute/bf-19.m compilation,  -O0 
UNRESOLVED: objc/execute/bf-19.m execution,  -O0 
FAIL: objc/execute/bf-19.m compilation,  -O1 
UNRESOLVED: objc/execute/bf-19.m execution,  -O1 
FAIL: objc/execute/bf-19.m compilation,  -O2 
UNRESOLVED: objc/execute/bf-19.m execution,  -O2 
FAIL: objc/execute/bf-19.m compilation,  -O3 -fomit-frame-pointer 
UNRESOLVED: objc/execute/bf-19.m execution,  -O3 -fomit-frame-pointer 
FAIL: objc/execute/bf-19.m compilation,  -O3 -g 
UNRESOLVED: objc/execute/bf-19.m execution,  -O3 -g 
FAIL: objc/execute/bf-19.m compilation,  -Os 
UNRESOLVED: objc/execute/bf-19.m execution,  -Os 
FAIL: objc/execute/bf-2.m compilation,  -O0 
UNRESOLVED: objc/execute/bf-2.m execution,  -O0 
FAIL: objc/execute/bf-2.m compilation,  -O1 
UNRESOLVED: objc/execute/bf-2.m execution,  -O1 
FAIL: objc/execute/bf-2.m compilation,  -O2 
UNRESOLVED: objc/execute/bf-2.m execution,  -O2 
FAIL: objc/execute/bf-2.m compilation,  -O3 -fomit-frame-pointer 
UNRESOLVED: objc/execute/bf-2.m execution,  -O3 -fomit-frame-pointer 
FAIL: objc/execute/bf-2.m compilation,  -O3 -g 
UNRESOLVED: objc/execute/bf-2.m execution,  -O3 -g 
FAIL: objc/execute/bf-2.m compilation,  -Os 
UNRESOLVED: objc/execute/bf-2.m execution,  -Os 
FAIL: objc/execute/bf-20.m compilation,  -O0 
UNRESOLVED: objc/execute/bf-20.m execution,  -O0 
FAIL: objc/execute/bf-20.m compilation,  -O1 
UNRESOLVED: objc/execute/bf-20.m execution,  -O1 
FAIL: objc/execute/bf-20.m compilation,  -O2 
UNRESOLVED: objc/execute/bf-20.m execution,  -O2 
FAIL: objc/execute/bf-20.m compilation,  -O3 -fomit-frame-pointer 
UNRESOLVED: objc/execute/bf-20.m execution,  -O3 -fomit-frame-pointer 
FAIL: objc/execute/bf-20.m compilation,  -O3 -g 
UNRESOLVED: objc/execute/bf-20.m execution,  -O3 -g 
FAIL: objc/execute/bf-20.m compilation,  -Os 
UNRESOLVED: objc/execute/bf-20.m execution,  -Os 
FAIL: objc/execute/bf-21.m compilation,  -O0 
UNRESOLVED: objc/execute/bf-21.m execution,  -O0 
FAIL: objc/execute/bf-21.m compilation,  -O1 
UNRESOLVED: objc/execute/bf-21.m execution,  -O1 
FAIL: objc/execute/bf-21.m compilation,  -O2 
UNRESOLVED: objc/execute/bf-21.m execution,  -O2 
FAIL: objc/execute/bf-21.m compilation,  -O3 -fomit-frame-pointer 
UNRESOLVED: objc/execute/bf-21.m execution,  -O3 -fomit-frame-pointer 
FAIL: objc/execute/bf-21.m compilation,  -O3 -g 
UNRESOLVED: objc/execute/bf-21.m execution,  -O3 -g 
FAIL: objc/execute/bf-21.m compilation,  -Os 
UNRESOLVED: objc/execute/bf-21.m execution,  -Os 
FAIL: objc/execute/bf-3.m compilation,  -O0 
UNRESOLVED: objc/execute/bf-3.m execution,  -O0 
FAIL: objc/execute/bf-3.m compilation,  -O1 
UNRESOLVED: objc/execute/bf-3.m execution,  -O1 
FAIL: objc/execute/bf-3.m compilation,  -O2 
UNRESOLVED: objc/execute/bf-3.m execution,  -O2 
FAIL: objc/execute/bf-3.m compilation,  -O3 -fomit-frame-pointer 
UNRESOLVED: objc/execute/bf-3.m execution,  -O3 -fomit-frame-pointer 
FAIL: objc/execute/bf-3.m compilation,  -O3 -g 
UNRESOLVED: objc/execute/bf-3.m execution,  -O3 -g 
FAIL: objc/execute/bf-3.m compilation,  -Os 
UNRESOLVED: objc/execute/bf-3.m execution,  -Os 
FAIL: objc/execute/bf-4.m compilation,  -O0 
UNRESOLVED: objc/execute/bf-4.m execution,  -O0 
FAIL: objc/execute/bf-4.m compilation,  -O1 
UNRESOLVED: objc/execute/bf-4.m execution,  -O1 
FAIL: objc/execute/bf-4.m compilation,  -O2 
UNRESOLVED: objc/execute/bf-4.m execution,  -O2 
FAIL: objc/execute/bf-4.m compilation,  -O3 -fomit-frame-pointer 
UNRESOLVED: objc/execute/bf-4.m execution,  -O3 -fomit-frame-pointer 
FAIL: objc/execute/bf-4.m compilation,  -O3 -g 
UNRESOLVED: objc/execute/bf-4.m execution,  -O3 -g 
FAIL: objc/execute/bf-4.m compilation,  -Os 
UNRESOLVED: objc/execute/bf-4.m execution,  -Os 
FAIL: objc/execute/bf-5.m compilation,  -O0 
UNRESOLVED: objc/execute/bf-5.m execution,  -O0 
FAIL: objc/execute/bf-5.m compilation,  -O1 
UNRESOLVED: objc/execute/bf-5.m execution,  -O1 
FAIL: objc/execute/bf-5.m compilation,  -O2 
UNRESOLVED: objc/execute/bf-5.m execution,  -O2 
FAIL: objc/execute/bf-5.m compilation,  -O3 -fomit-frame-pointer 
UNRESOLVED: objc/execute/bf-5.m execution,  -O3 -fomit-frame-pointer 
FAIL: objc/execute/bf-5.m compilation,  -O3 -g 
UNRESOLVED: objc/execute/bf-5.m execution,  -O3 -g 
FAIL: objc/execute/bf-5.m compilation,  -Os 
UNRESOLVED: objc/execute/bf-5.m execution,  -Os 
FAIL: objc/execute/bf-6.m compilation,  -O0 
UNRESOLVED: objc/execute/bf-6.m execution,  -O0 
FAIL: objc/execute/bf-6.m compilation,  -O1 
UNRESOLVED: objc/execute/bf-6.m execution,  -O1 
FAIL: objc/execute/bf-6.m compilation,  -O2 
UNRESOLVED: objc/execute/bf-6.m execution,  -O2 
FAIL: objc/execute/bf-6.m compilation,  -O3 -fomit-frame-pointer 
UNRESOLVED: objc/execute/bf-6.m execution,  -O3 -fomit-frame-pointer 
FAIL: objc/execute/bf-6.m compilation,  -O3 -g 
UNRESOLVED: objc/execute/bf-6.m execution,  -O3 -g 
FAIL: objc/execute/bf-6.m compilation,  -Os 
UNRESOLVED: objc/execute/bf-6.m execution,  -Os 
FAIL: objc/execute/bf-7.m compilation,  -O0 
UNRESOLVED: objc/execute/bf-7.m execution,  -O0 
FAIL: objc/execute/bf-7.m compilation,  -O1 
UNRESOLVED: objc/execute/bf-7.m execution,  -O1 
FAIL: objc/execute/bf-7.m compilation,  -O2 
UNRESOLVED: objc/execute/bf-7.m execution,  -O2 
FAIL: objc/execute/bf-7.m compilation,  -O3 -fomit-frame-pointer 
UNRESOLVED: objc/execute/bf-7.m execution,  -O3 -fomit-frame-pointer 
FAIL: objc/execute/bf-7.m compilation,  -O3 -g 
UNRESOLVED: objc/execute/bf-7.m execution,  -O3 -g 
FAIL: objc/execute/bf-7.m compilation,  -Os 
UNRESOLVED: objc/execute/bf-7.m execution,  -Os 
FAIL: objc/execute/bf-8.m compilation,  -O0 
UNRESOLVED: objc/execute/bf-8.m execution,  -O0 
FAIL: objc/execute/bf-8.m compilation,  -O1 
UNRESOLVED: objc/execute/bf-8.m execution,  -O1 
FAIL: objc/execute/bf-8.m compilation,  -O2 
UNRESOLVED: objc/execute/bf-8.m execution,  -O2 
FAIL: objc/execute/bf-8.m compilation,  -O3 -fomit-frame-pointer 
UNRESOLVED: objc/execute/bf-8.m execution,  -O3 -fomit-frame-pointer 
FAIL: objc/execute/bf-8.m compilation,  -O3 -g 
UNRESOLVED: objc/execute/bf-8.m execution,  -O3 -g 
FAIL: objc/execute/bf-8.m compilation,  -Os 
UNRESOLVED: objc/execute/bf-8.m execution,  -Os 
FAIL: objc/execute/bf-9.m compilation,  -O0 
UNRESOLVED: objc/execute/bf-9.m execution,  -O0 
FAIL: objc/execute/bf-9.m compilation,  -O1 
UNRESOLVED: objc/execute/bf-9.m execution,  -O1 
FAIL: objc/execute/bf-9.m compilation,  -O2 
UNRESOLVED: objc/execute/bf-9.m execution,  -O2 
FAIL: objc/execute/bf-9.m compilation,  -O3 -fomit-frame-pointer 
UNRESOLVED: objc/execute/bf-9.m execution,  -O3 -fomit-frame-pointer 
FAIL: objc/execute/bf-9.m compilation,  -O3 -g 
UNRESOLVED: objc/execute/bf-9.m execution,  -O3 -g 
FAIL: objc/execute/bf-9.m compilation,  -Os 
UNRESOLVED: objc/execute/bf-9.m execution,  -Os 
FAIL: objc/execute/bycopy-3.m compilation,  -O0 
UNRESOLVED: objc/execute/bycopy-3.m execution,  -O0 
FAIL: objc/execute/bycopy-3.m compilation,  -O1 
UNRESOLVED: objc/execute/bycopy-3.m execution,  -O1 
FAIL: objc/execute/bycopy-3.m compilation,  -O2 
UNRESOLVED: objc/execute/bycopy-3.m execution,  -O2 
FAIL: objc/execute/bycopy-3.m compilation,  -O3 -fomit-frame-pointer 
UNRESOLVED: objc/execute/bycopy-3.m execution,  -O3 -fomit-frame-pointer 
FAIL: objc/execute/bycopy-3.m compilation,  -O3 -g 
UNRESOLVED: objc/execute/bycopy-3.m execution,  -O3 -g 
FAIL: objc/execute/bycopy-3.m compilation,  -Os 
UNRESOLVED: objc/execute/bycopy-3.m execution,  -Os 
FAIL: objc/execute/class-1.m compilation,  -O0 
UNRESOLVED: objc/execute/class-1.m execution,  -O0 
FAIL: objc/execute/class-1.m compilation,  -O1 
UNRESOLVED: objc/execute/class-1.m execution,  -O1 
FAIL: objc/execute/class-1.m compilation,  -O2 
UNRESOLVED: objc/execute/class-1.m execution,  -O2 
FAIL: objc/execute/class-1.m compilation,  -O3 -fomit-frame-pointer 
UNRESOLVED: objc/execute/class-1.m execution,  -O3 -fomit-frame-pointer 
FAIL: objc/execute/class-1.m compilation,  -O3 -g 
UNRESOLVED: objc/execute/class-1.m execution,  -O3 -g 
FAIL: objc/execute/class-1.m compilation,  -Os 
UNRESOLVED: objc/execute/class-1.m execution,  -Os 
FAIL: objc/execute/class-10.m compilation,  -O0 
UNRESOLVED: objc/execute/class-10.m execution,  -O0 
FAIL: objc/execute/class-10.m compilation,  -O1 
UNRESOLVED: objc/execute/class-10.m execution,  -O1 
FAIL: objc/execute/class-10.m compilation,  -O2 
UNRESOLVED: objc/execute/class-10.m execution,  -O2 
FAIL: objc/execute/class-10.m compilation,  -O3 -fomit-frame-pointer 
UNRESOLVED: objc/execute/class-10.m execution,  -O3 -fomit-frame-pointer 
FAIL: objc/execute/class-10.m compilation,  -O3 -g 
UNRESOLVED: objc/execute/class-10.m execution,  -O3 -g 
FAIL: objc/execute/class-10.m compilation,  -Os 
UNRESOLVED: objc/execute/class-10.m execution,  -Os 
FAIL: objc/execute/class-11.m compilation,  -O0 
UNRESOLVED: objc/execute/class-11.m execution,  -O0 
FAIL: objc/execute/class-11.m compilation,  -O1 
UNRESOLVED: objc/execute/class-11.m execution,  -O1 
FAIL: objc/execute/class-11.m compilation,  -O2 
UNRESOLVED: objc/execute/class-11.m execution,  -O2 
FAIL: objc/execute/class-11.m compilation,  -O3 -fomit-frame-pointer 
UNRESOLVED: objc/execute/class-11.m execution,  -O3 -fomit-frame-pointer 
FAIL: objc/execute/class-11.m compilation,  -O3 -g 
UNRESOLVED: objc/execute/class-11.m execution,  -O3 -g 
FAIL: objc/execute/class-11.m compilation,  -Os 
UNRESOLVED: objc/execute/class-11.m execution,  -Os 
FAIL: objc/execute/class-12.m compilation,  -O0 
UNRESOLVED: objc/execute/class-12.m execution,  -O0 
FAIL: objc/execute/class-12.m compilation,  -O1 
UNRESOLVED: objc/execute/class-12.m execution,  -O1 
FAIL: objc/execute/class-12.m compilation,  -O2 
UNRESOLVED: objc/execute/class-12.m execution,  -O2 
FAIL: objc/execute/class-12.m compilation,  -O3 -fomit-frame-pointer 
UNRESOLVED: objc/execute/class-12.m execution,  -O3 -fomit-frame-pointer 
FAIL: objc/execute/class-12.m compilation,  -O3 -g 
UNRESOLVED: objc/execute/class-12.m execution,  -O3 -g 
FAIL: objc/execute/class-12.m compilation,  -Os 
UNRESOLVED: objc/execute/class-12.m execution,  -Os 
FAIL: objc/execute/class-13.m compilation,  -O0 
UNRESOLVED: objc/execute/class-13.m execution,  -O0 
FAIL: objc/execute/class-13.m compilation,  -O1 
UNRESOLVED: objc/execute/class-13.m execution,  -O1 
FAIL: objc/execute/class-13.m compilation,  -O2 
UNRESOLVED: objc/execute/class-13.m execution,  -O2 
FAIL: objc/execute/class-13.m compilation,  -O3 -fomit-frame-pointer 
UNRESOLVED: objc/execute/class-13.m execution,  -O3 -fomit-frame-pointer 
FAIL: objc/execute/class-13.m compilation,  -O3 -g 
UNRESOLVED: objc/execute/class-13.m execution,  -O3 -g 
FAIL: objc/execute/class-13.m compilation,  -Os 
UNRESOLVED: objc/execute/class-13.m execution,  -Os 
FAIL: objc/execute/class-14.m compilation,  -O0 
UNRESOLVED: objc/execute/class-14.m execution,  -O0 
FAIL: objc/execute/class-14.m compilation,  -O1 
UNRESOLVED: objc/execute/class-14.m execution,  -O1 
FAIL: objc/execute/class-14.m compilation,  -O2 
UNRESOLVED: objc/execute/class-14.m execution,  -O2 
FAIL: objc/execute/class-14.m compilation,  -O3 -fomit-frame-pointer 
UNRESOLVED: objc/execute/class-14.m execution,  -O3 -fomit-frame-pointer 
FAIL: objc/execute/class-14.m compilation,  -O3 -g 
UNRESOLVED: objc/execute/class-14.m execution,  -O3 -g 
FAIL: objc/execute/class-14.m compilation,  -Os 
UNRESOLVED: objc/execute/class-14.m execution,  -Os 
FAIL: objc/execute/class-2.m compilation,  -O0 
UNRESOLVED: objc/execute/class-2.m execution,  -O0 
FAIL: objc/execute/class-2.m compilation,  -O1 
UNRESOLVED: objc/execute/class-2.m execution,  -O1 
FAIL: objc/execute/class-2.m compilation,  -O2 
UNRESOLVED: objc/execute/class-2.m execution,  -O2 
FAIL: objc/execute/class-2.m compilation,  -O3 -fomit-frame-pointer 
UNRESOLVED: objc/execute/class-2.m execution,  -O3 -fomit-frame-pointer 
FAIL: objc/execute/class-2.m compilation,  -O3 -g 
UNRESOLVED: objc/execute/class-2.m execution,  -O3 -g 
FAIL: objc/execute/class-2.m compilation,  -Os 
UNRESOLVED: objc/execute/class-2.m execution,  -Os 
FAIL: objc/execute/class-3.m compilation,  -O0 
UNRESOLVED: objc/execute/class-3.m execution,  -O0 
FAIL: objc/execute/class-3.m compilation,  -O1 
UNRESOLVED: objc/execute/class-3.m execution,  -O1 
FAIL: objc/execute/class-3.m compilation,  -O2 
UNRESOLVED: objc/execute/class-3.m execution,  -O2 
FAIL: objc/execute/class-3.m compilation,  -O3 -fomit-frame-pointer 
UNRESOLVED: objc/execute/class-3.m execution,  -O3 -fomit-frame-pointer 
FAIL: objc/execute/class-3.m compilation,  -O3 -g 
UNRESOLVED: objc/execute/class-3.m execution,  -O3 -g 
FAIL: objc/execute/class-3.m compilation,  -Os 
UNRESOLVED: objc/execute/class-3.m execution,  -Os 
FAIL: objc/execute/class-4.m compilation,  -O0 
UNRESOLVED: objc/execute/class-4.m execution,  -O0 
FAIL: objc/execute/class-4.m compilation,  -O1 
UNRESOLVED: objc/execute/class-4.m execution,  -O1 
FAIL: objc/execute/class-4.m compilation,  -O2 
UNRESOLVED: objc/execute/class-4.m execution,  -O2 
FAIL: objc/execute/class-4.m compilation,  -O3 -fomit-frame-pointer 
UNRESOLVED: objc/execute/class-4.m execution,  -O3 -fomit-frame-pointer 
FAIL: objc/execute/class-4.m compilation,  -O3 -g 
UNRESOLVED: objc/execute/class-4.m execution,  -O3 -g 
FAIL: objc/execute/class-4.m compilation,  -Os 
UNRESOLVED: objc/execute/class-4.m execution,  -Os 
FAIL: objc/execute/class-5.m compilation,  -O0 
UNRESOLVED: objc/execute/class-5.m execution,  -O0 
FAIL: objc/execute/class-5.m compilation,  -O1 
UNRESOLVED: objc/execute/class-5.m execution,  -O1 
FAIL: objc/execute/class-5.m compilation,  -O2 
UNRESOLVED: objc/execute/class-5.m execution,  -O2 
FAIL: objc/execute/class-5.m compilation,  -O3 -fomit-frame-pointer 
UNRESOLVED: objc/execute/class-5.m execution,  -O3 -fomit-frame-pointer 
FAIL: objc/execute/class-5.m compilation,  -O3 -g 
UNRESOLVED: objc/execute/class-5.m execution,  -O3 -g 
FAIL: objc/execute/class-5.m compilation,  -Os 
UNRESOLVED: objc/execute/class-5.m execution,  -Os 
FAIL: objc/execute/class-6.m compilation,  -O0 
UNRESOLVED: objc/execute/class-6.m execution,  -O0 
FAIL: objc/execute/class-6.m compilation,  -O1 
UNRESOLVED: objc/execute/class-6.m execution,  -O1 
FAIL: objc/execute/class-6.m compilation,  -O2 
UNRESOLVED: objc/execute/class-6.m execution,  -O2 
FAIL: objc/execute/class-6.m compilation,  -O3 -fomit-frame-pointer 
UNRESOLVED: objc/execute/class-6.m execution,  -O3 -fomit-frame-pointer 
FAIL: objc/execute/class-6.m compilation,  -O3 -g 
UNRESOLVED: objc/execute/class-6.m execution,  -O3 -g 
FAIL: objc/execute/class-6.m compilation,  -Os 
UNRESOLVED: objc/execute/class-6.m execution,  -Os 
FAIL: objc/execute/class-7.m compilation,  -O0 
UNRESOLVED: objc/execute/class-7.m execution,  -O0 
FAIL: objc/execute/class-7.m compilation,  -O1 
UNRESOLVED: objc/execute/class-7.m execution,  -O1 
FAIL: objc/execute/class-7.m compilation,  -O2 
UNRESOLVED: objc/execute/class-7.m execution,  -O2 
FAIL: objc/execute/class-7.m compilation,  -O3 -fomit-frame-pointer 
UNRESOLVED: objc/execute/class-7.m execution,  -O3 -fomit-frame-pointer 
FAIL: objc/execute/class-7.m compilation,  -O3 -g 
UNRESOLVED: objc/execute/class-7.m execution,  -O3 -g 
FAIL: objc/execute/class-7.m compilation,  -Os 
UNRESOLVED: objc/execute/class-7.m execution,  -Os 
FAIL: objc/execute/class-8.m compilation,  -O0 
UNRESOLVED: objc/execute/class-8.m execution,  -O0 
FAIL: objc/execute/class-8.m compilation,  -O1 
UNRESOLVED: objc/execute/class-8.m execution,  -O1 
FAIL: objc/execute/class-8.m compilation,  -O2 
UNRESOLVED: objc/execute/class-8.m execution,  -O2 
FAIL: objc/execute/class-8.m compilation,  -O3 -fomit-frame-pointer 
UNRESOLVED: objc/execute/class-8.m execution,  -O3 -fomit-frame-pointer 
FAIL: objc/execute/class-8.m compilation,  -O3 -g 
UNRESOLVED: objc/execute/class-8.m execution,  -O3 -g 
FAIL: objc/execute/class-8.m compilation,  -Os 
UNRESOLVED: objc/execute/class-8.m execution,  -Os 
FAIL: objc/execute/class-9.m compilation,  -O0 
UNRESOLVED: objc/execute/class-9.m execution,  -O0 
FAIL: objc/execute/class-9.m compilation,  -O1 
UNRESOLVED: objc/execute/class-9.m execution,  -O1 
FAIL: objc/execute/class-9.m compilation,  -O2 
UNRESOLVED: objc/execute/class-9.m execution,  -O2 
FAIL: objc/execute/class-9.m compilation,  -O3 -fomit-frame-pointer 
UNRESOLVED: objc/execute/class-9.m execution,  -O3 -fomit-frame-pointer 
FAIL: objc/execute/class-9.m compilation,  -O3 -g 
UNRESOLVED: objc/execute/class-9.m execution,  -O3 -g 
FAIL: objc/execute/class-9.m compilation,  -Os 
UNRESOLVED: objc/execute/class-9.m execution,  -Os 
FAIL: objc/execute/class_self-1.m execution,  -O0 
FAIL: objc/execute/class_self-1.m execution,  -O1 
FAIL: objc/execute/class_self-1.m execution,  -O2 
FAIL: objc/execute/class_self-1.m execution,  -O3 -fomit-frame-pointer 
FAIL: objc/execute/class_self-1.m execution,  -O3 -g 
FAIL: objc/execute/class_self-1.m execution,  -Os 
FAIL: objc/execute/class_self-2.m execution,  -O0 
FAIL: objc/execute/class_self-2.m execution,  -O1 
FAIL: objc/execute/class_self-2.m execution,  -O2 
FAIL: objc/execute/class_self-2.m execution,  -O3 -fomit-frame-pointer 
FAIL: objc/execute/class_self-2.m execution,  -O3 -g 
FAIL: objc/execute/class_self-2.m execution,  -Os 
FAIL: objc/execute/many_args_method.m execution,  -O0 
FAIL: objc/execute/many_args_method.m execution,  -O1 
FAIL: objc/execute/many_args_method.m execution,  -O2 
FAIL: objc/execute/many_args_method.m execution,  -O3 -fomit-frame-pointer 
FAIL: objc/execute/many_args_method.m execution,  -O3 -g 
FAIL: objc/execute/many_args_method.m execution,  -Os 
FAIL: objc/execute/nested-3.m execution,  -O0 
FAIL: objc/execute/nested-3.m execution,  -O1 
FAIL: objc/execute/nested-3.m execution,  -O2 
FAIL: objc/execute/nested-3.m execution,  -O3 -fomit-frame-pointer 
FAIL: objc/execute/nested-3.m execution,  -O3 -g 
FAIL: objc/execute/nested-3.m execution,  -Os 
FAIL: objc/execute/np-2.m execution,  -O0 
FAIL: objc/execute/np-2.m execution,  -O1 
FAIL: objc/execute/np-2.m execution,  -O2 
FAIL: objc/execute/np-2.m execution,  -O3 -fomit-frame-pointer 
FAIL: objc/execute/np-2.m execution,  -O3 -g 
FAIL: objc/execute/np-2.m execution,  -Os 
FAIL: objc/execute/redefining_self.m execution,  -O0 
FAIL: objc/execute/redefining_self.m execution,  -O1 
FAIL: objc/execute/redefining_self.m execution,  -O2 
FAIL: objc/execute/redefining_self.m execution,  -O3 -fomit-frame-pointer 
FAIL: objc/execute/redefining_self.m execution,  -O3 -g 
FAIL: objc/execute/redefining_self.m execution,  -Os 
FAIL: objc/execute/root_methods.m compilation,  -O0 
UNRESOLVED: objc/execute/root_methods.m execution,  -O0 
FAIL: objc/execute/root_methods.m compilation,  -O1 
UNRESOLVED: objc/execute/root_methods.m execution,  -O1 
FAIL: objc/execute/root_methods.m compilation,  -O2 
UNRESOLVED: objc/execute/root_methods.m execution,  -O2 
FAIL: objc/execute/root_methods.m compilation,  -O3 -fomit-frame-pointer 
UNRESOLVED: objc/execute/root_methods.m execution,  -O3 -fomit-frame-pointer 
FAIL: objc/execute/root_methods.m compilation,  -O3 -g 
UNRESOLVED: objc/execute/root_methods.m execution,  -O3 -g 
FAIL: objc/execute/root_methods.m compilation,  -Os 
UNRESOLVED: objc/execute/root_methods.m execution,  -Os 
FAIL: objc/execute/static-1.m execution,  -O0 
FAIL: objc/execute/static-1.m execution,  -O1 
FAIL: objc/execute/static-1.m execution,  -O2 
FAIL: objc/execute/static-1.m execution,  -O3 -fomit-frame-pointer 
FAIL: objc/execute/static-1.m execution,  -O3 -g 
FAIL: objc/execute/static-1.m execution,  -Os 
FAIL: objc/execute/static-2.m execution,  -O0 
FAIL: objc/execute/static-2.m execution,  -O1 
FAIL: objc/execute/static-2.m execution,  -O2 
FAIL: objc/execute/static-2.m execution,  -O3 -fomit-frame-pointer 
FAIL: objc/execute/static-2.m execution,  -O3 -g 
FAIL: objc/execute/static-2.m execution,  -Os 
FAIL: objc/execute/string1.m compilation,  -O0 
UNRESOLVED: objc/execute/string1.m execution,  -O0 
FAIL: objc/execute/string1.m compilation,  -O1 
UNRESOLVED: objc/execute/string1.m execution,  -O1 
FAIL: objc/execute/string1.m compilation,  -O2 
UNRESOLVED: objc/execute/string1.m execution,  -O2 
FAIL: objc/execute/string1.m compilation,  -O3 -fomit-frame-pointer 
UNRESOLVED: objc/execute/string1.m execution,  -O3 -fomit-frame-pointer 
FAIL: objc/execute/string1.m compilation,  -O3 -g 
UNRESOLVED: objc/execute/string1.m execution,  -O3 -g 
FAIL: objc/execute/string1.m compilation,  -Os 
UNRESOLVED: objc/execute/string1.m execution,  -Os 
FAIL: objc/execute/string2.m compilation,  -O0 
UNRESOLVED: objc/execute/string2.m execution,  -O0 
FAIL: objc/execute/string2.m compilation,  -O1 
UNRESOLVED: objc/execute/string2.m execution,  -O1 
FAIL: objc/execute/string2.m compilation,  -O2 
UNRESOLVED: objc/execute/string2.m execution,  -O2 
FAIL: objc/execute/string2.m compilation,  -O3 -fomit-frame-pointer 
UNRESOLVED: objc/execute/string2.m execution,  -O3 -fomit-frame-pointer 
FAIL: objc/execute/string2.m compilation,  -O3 -g 
UNRESOLVED: objc/execute/string2.m execution,  -O3 -g 
FAIL: objc/execute/string2.m compilation,  -Os 
UNRESOLVED: objc/execute/string2.m execution,  -Os 
FAIL: objc/execute/string3.m compilation,  -O0 
UNRESOLVED: objc/execute/string3.m execution,  -O0 
FAIL: objc/execute/string3.m compilation,  -O1 
UNRESOLVED: objc/execute/string3.m execution,  -O1 
FAIL: objc/execute/string3.m compilation,  -O2 
UNRESOLVED: objc/execute/string3.m execution,  -O2 
FAIL: objc/execute/string3.m compilation,  -O3 -fomit-frame-pointer 
UNRESOLVED: objc/execute/string3.m execution,  -O3 -fomit-frame-pointer 
FAIL: objc/execute/string3.m compilation,  -O3 -g 
UNRESOLVED: objc/execute/string3.m execution,  -O3 -g 
FAIL: objc/execute/string3.m compilation,  -Os 
UNRESOLVED: objc/execute/string3.m execution,  -Os 
FAIL: objc/execute/string4.m compilation,  -O0 
UNRESOLVED: objc/execute/string4.m execution,  -O0 
FAIL: objc/execute/string4.m compilation,  -O1 
UNRESOLVED: objc/execute/string4.m execution,  -O1 
FAIL: objc/execute/string4.m compilation,  -O2 
UNRESOLVED: objc/execute/string4.m execution,  -O2 
FAIL: objc/execute/string4.m compilation,  -O3 -fomit-frame-pointer 
UNRESOLVED: objc/execute/string4.m execution,  -O3 -fomit-frame-pointer 
FAIL: objc/execute/string4.m compilation,  -O3 -g 
UNRESOLVED: objc/execute/string4.m execution,  -O3 -g 
FAIL: objc/execute/string4.m compilation,  -Os 
UNRESOLVED: objc/execute/string4.m execution,  -Os 
FAIL: objc/execute/va_method.m execution,  -O0 
FAIL: objc/execute/va_method.m execution,  -O1 
FAIL: objc/execute/va_method.m execution,  -O2 
FAIL: objc/execute/va_method.m execution,  -O3 -fomit-frame-pointer 
FAIL: objc/execute/va_method.m execution,  -O3 -fomit-frame-pointer -funroll-loops 
FAIL: objc/execute/va_method.m execution,  -O3 -fomit-frame-pointer -funroll-all-loops
-finline-functions 
FAIL: objc/execute/va_method.m execution,  -O3 -g 
FAIL: objc/execute/va_method.m execution,  -Os 
FAIL: objc.dg/special/unclaimed-category-1.m (test for excess errors)
WARNING: objc.dg/special/unclaimed-category-1.m compilation failed to produce executable

		=== objc Summary ===

# of expected passes		582
# of unexpected failures	315
# of unresolved testcases	258
/Users/regress/tbox/native/build/gcc/xgcc version 3.4 20030731 (experimental)

		=== libstdc++-v3 tests ===

Running target unix
FAIL: 22_locale/numpunct/members/pod/1.cc (test for excess errors)
WARNING: 22_locale/numpunct/members/pod/1.cc compilation failed to produce executable
FAIL: 22_locale/numpunct/members/pod/2.cc (test for excess errors)
WARNING: 22_locale/numpunct/members/pod/2.cc compilation failed to produce executable
FAIL: 26_numerics/c99_classification_macros_c++.cc (test for excess errors)
FAIL: 26_numerics/c99_classification_macros_c.cc (test for excess errors)
FAIL: 27_io/basic_filebuf/open/char/9507.cc execution test
FAIL: ext/pod_char_traits.cc (test for excess errors)
WARNING: ext/pod_char_traits.cc compilation failed to produce executable

		=== libstdc++-v3 Summary ===

# of expected passes		1532
# of unexpected failures	6

Compiler version: 3.4 20030731 (experimental) 
Platform: powerpc-apple-darwin6.3
configure flags: --prefix=/Users/regress/tbox/objs --target=powerpc-apple-darwin6.3

Loren James Rittle | 1 Aug 02:36 2003
Picon

Results for 3.3.1 20030731 (prerelease) testsuite on alpha-unknown-freebsd5.1

Using make with objdir configuration on beast (see key)

Bootstrap failed in libjava; attempted gmake recovery
NOTE: Failed to install without error
LAST_UPDATED: Thu Jul 31 20:53:46 GMT 2003

Native configuration is alpha-unknown-freebsd5.1

		=== libstdc++-v3 tests ===

Running target unix
FAIL: 18_support/numeric_limits.cc execution test
XPASS: 22_locale/ctype_is_wchar_t.cc execution test
FAIL: 27_io/filebuf_members.cc execution test

		=== libstdc++-v3 Summary ===

# of expected passes		451
# of unexpected failures	2
# of unexpected successes	1
# of expected failures		27
		=== g++ tests ===

Running target unix/-pthread
FAIL: g++.dg/expr/anew1.C execution test
FAIL: g++.dg/expr/anew2.C execution test
FAIL: g++.dg/expr/anew3.C execution test
FAIL: g++.dg/expr/anew4.C execution test
FAIL: g++.dg/tls/init-2.C (test for excess errors)
FAIL: g++.eh/badalloc1.C  Execution test
FAIL: g++.law/profile1.C (test for excess errors)
FAIL: g++.pt/repo3.C (test for excess errors)

		=== g++ Summary ===

# of expected passes		8052
# of unexpected failures	8
# of expected failures		96
# of untested testcases		22
# of unsupported tests		27
/j/ljrittle/gcc-build-beast-0731/gcc/testsuite/../g++ version 3.3.1 20030731 (prerelease)

		=== g77 tests ===

Running target unix/-pthread

		=== g77 Summary ===

# of expected passes		1686
# of unsupported tests		8
/j/ljrittle/gcc-build-beast-0731/gcc/testsuite/../g77 version 3.3.1 20030731 (prerelease)

		=== gcc tests ===

Running target unix/-pthread
FAIL: gcc.c-torture/execute/20020227-1.c compilation,  -O0 
UNRESOLVED: gcc.c-torture/execute/20020227-1.c execution,  -O0 
FAIL: gcc.c-torture/execute/20020227-1.c compilation,  -O1 
UNRESOLVED: gcc.c-torture/execute/20020227-1.c execution,  -O1 
FAIL: gcc.c-torture/execute/20020227-1.c compilation,  -O2 
UNRESOLVED: gcc.c-torture/execute/20020227-1.c execution,  -O2 
FAIL: gcc.c-torture/execute/20020227-1.c compilation,  -O3 -fomit-frame-pointer 
UNRESOLVED: gcc.c-torture/execute/20020227-1.c execution,  -O3 -fomit-frame-pointer 
FAIL: gcc.c-torture/execute/20020227-1.c compilation,  -O3 -g 
UNRESOLVED: gcc.c-torture/execute/20020227-1.c execution,  -O3 -g 
FAIL: gcc.c-torture/execute/20020227-1.c compilation,  -Os 
UNRESOLVED: gcc.c-torture/execute/20020227-1.c execution,  -Os 
FAIL: gcc.c-torture/execute/simd-2.c compilation,  -O3 -fomit-frame-pointer 
UNRESOLVED: gcc.c-torture/execute/simd-2.c execution,  -O3 -fomit-frame-pointer 
FAIL: gcc.c-torture/execute/simd-2.c compilation,  -O3 -g 
UNRESOLVED: gcc.c-torture/execute/simd-2.c execution,  -O3 -g 
FAIL: gcc.dg/20020607-2.c (test for excess errors)
WARNING: gcc.dg/20020607-2.c compilation failed to produce executable
FAIL: gcc.dg/20021014-1.c (test for excess errors)
WARNING: gcc.dg/20021014-1.c compilation failed to produce executable
FAIL: gcc.dg/duff-2.c (test for excess errors)
FAIL: gcc.dg/fastmath-1.c (test for excess errors)
WARNING: gcc.dg/fastmath-1.c compilation failed to produce executable
FAIL: gcc.dg/fnegate-1.c (test for excess errors)
WARNING: gcc.dg/fnegate-1.c compilation failed to produce executable
FAIL: gcc.dg/nest.c (test for excess errors)
WARNING: gcc.dg/nest.c compilation failed to produce executable

		=== gcc Summary ===

# of expected passes		21328
# of unexpected failures	14
# of expected failures		72
# of unresolved testcases	8
# of unsupported tests		168
/j/ljrittle/gcc-build-beast-0731/gcc/xgcc version 3.3.1 20030731 (prerelease)

		=== objc tests ===

Running target unix/-pthread
FAIL: objc/execute/class-13.m compilation,  -O3 -fomit-frame-pointer 
UNRESOLVED: objc/execute/class-13.m execution,  -O3 -fomit-frame-pointer 
FAIL: objc/execute/class-13.m compilation,  -O3 -g 
UNRESOLVED: objc/execute/class-13.m execution,  -O3 -g 
FAIL: objc/execute/class-6.m compilation,  -O3 -fomit-frame-pointer 
UNRESOLVED: objc/execute/class-6.m execution,  -O3 -fomit-frame-pointer 
FAIL: objc/execute/class-6.m compilation,  -O3 -g 
UNRESOLVED: objc/execute/class-6.m execution,  -O3 -g 
FAIL: objc/execute/object_is_class.m compilation,  -O3 -fomit-frame-pointer 
UNRESOLVED: objc/execute/object_is_class.m execution,  -O3 -fomit-frame-pointer 
FAIL: objc/execute/object_is_class.m compilation,  -O3 -g 
UNRESOLVED: objc/execute/object_is_class.m execution,  -O3 -g 
FAIL: objc/execute/object_is_meta_class.m compilation,  -O3 -fomit-frame-pointer 
UNRESOLVED: objc/execute/object_is_meta_class.m execution,  -O3 -fomit-frame-pointer 
FAIL: objc/execute/object_is_meta_class.m compilation,  -O3 -g 
UNRESOLVED: objc/execute/object_is_meta_class.m execution,  -O3 -g 

		=== objc Summary ===

# of expected passes		1137
# of unexpected failures	8
# of unresolved testcases	8
/j/ljrittle/gcc-build-beast-0731/gcc/xgcc version 3.3.1 20030731 (prerelease)

Compiler version: 3.3.1 20030731 (prerelease) 
Platform: alpha-unknown-freebsd5.1
configure flags: --host=alpha-unknown-freebsd5.1
--prefix=/home/ljrittle/beast/tmp/install-beast --with-gnu-as --with-as=/usr/bin/as
--with-gnu-ld --with-ld=/usr/bin/ld
BOOT_CFLAGS=-g -O2
Key: gmake is GNU make
     make is BSD make as shipped on alpha-unknown-freebsd5.1
     srcdir means in-source configuration was done within the gcc source tree
     objdir means out-source configuration was done within a fresh directory
ref4 (3.3) and ref5 (mainline) attempt to build gcc twice daily;
once for srcdir configuration and once for objdir configuration;
odd number days use GNU make; even days use BSD make; missing
reports infer breakage; partial reports are made when bootstap
completes in gcc but fails in a support library.
beast (3.3) builds gcc once daily using gmake with objdir conf.
See http://people.freebsd.org/~ljrittle/daily-gcc-bootstrap-reports
for all related transcript logs and log.sent files (not staged
until after all daily bootstraps for a machine complete).

Robert Schiele | 1 Aug 02:53 2003
Picon

Results for 3.4 20030731 (experimental) testsuite on i586-suse-linux-gnu

Attachment: application/octet-stream, 3357 bytes
David.Billinghurst | 1 Aug 03:16 2003

Results for 3.4 20030731 (experimental) testsuite on i686-pc-cygwin

CYGWIN_NT-5.1 crw50 1.3.22(0.78/3/2) 2003-03-18 09:20 i686 unknown unknown Cygwin
Windows XP Professional Ver 5.1 Build 2600 Service Pack 1
PROCESSOR_IDENTIFIER = \`x86 Family 15 Model 0 Stepping 10, GenuineIntel'

LAST_UPDATED: Thu Jul 31 15:50:07 GMT 2003

Native configuration is i686-pc-cygwin

		=== g++ tests ===

Running target unix
FAIL: g++.dg/abi/bitfield3.C execution test
FAIL: g++.dg/abi/rtti1.C scan-assembler-dem-not \\ntypeinfo for A[: \\t\\n]
FAIL: g++.dg/abi/vcall1.C execution test
FAIL: g++.dg/eh/simd-2.C (test for excess errors)
WARNING: g++.dg/eh/simd-2.C compilation failed to produce executable
FAIL: g++.dg/ext/instantiate3.C scan-assembler-not 
FAIL: g++.dg/ext/pretty1.C scan-assembler top level
FAIL: g++.dg/ext/pretty2.C (test for excess errors)
WARNING: g++.dg/ext/pretty2.C compilation failed to produce executable
FAIL: g++.dg/inherit/covariant1.C execution test
FAIL: g++.dg/inherit/covariant2.C execution test
FAIL: g++.dg/inherit/covariant3.C execution test
FAIL: g++.dg/inherit/covariant4.C execution test
FAIL: g++.dg/init/array10.C (test for excess errors)
FAIL: g++.dg/init/array4.C (test for excess errors)
FAIL: g++.dg/opt/vt1.C scan-assembler-not section[^
FAIL: g++.dg/parse/parse5.C (test for excess errors)
FAIL: g++.dg/parse/stack1.C (test for excess errors)
FAIL: g++.dg/template/friend.C (test for excess errors)
FAIL: g++.dg/template/friend10.C (test for excess errors)
WARNING: g++.dg/template/friend10.C compilation failed to produce executable
FAIL: empty.H (test for excess errors)
FAIL: empty.H (test for excess errors)
FAIL: empty.H (test for excess errors)
FAIL: g++.dg/pch/static-1.C (test for excess errors)
FAIL: g++.dg/pch/static-1.C (test for excess errors)
FAIL: g++.dg/pch/static-1.C (test for excess errors)
FAIL: g++.dg/pch/system-1.C (test for excess errors)
FAIL: g++.dg/pch/system-1.C (test for excess errors)
FAIL: g++.dg/pch/system-1.C (test for excess errors)
FAIL: g++.dg/pch/system-2.C (test for excess errors)
FAIL: g++.dg/pch/system-2.C (test for excess errors)
FAIL: g++.dg/pch/system-2.C (test for excess errors)
FAIL: g++.dg/special/initp1.C execution test
FAIL: g++.old-deja/g++.abi/vtable3a.C execution test
FAIL: g++.old-deja/g++.abi/vtable3b.C execution test
FAIL: g++.old-deja/g++.abi/vtable3c.C execution test
FAIL: g++.old-deja/g++.abi/vtable3d.C execution test
FAIL: g++.old-deja/g++.abi/vtable3e.C execution test
FAIL: g++.old-deja/g++.abi/vtable3f.C execution test
FAIL: g++.old-deja/g++.abi/vtable3g.C execution test
FAIL: g++.old-deja/g++.abi/vtable3h.C execution test
FAIL: g++.old-deja/g++.abi/vtable3i.C execution test
FAIL: g++.old-deja/g++.abi/vtable3j.C execution test
FAIL: g++.old-deja/g++.benjamin/15071.C (test for excess errors)
WARNING: g++.old-deja/g++.benjamin/15071.C compilation failed to produce executable
FAIL: g++.old-deja/g++.brendan/copy9.C (test for excess errors)
WARNING: g++.old-deja/g++.brendan/copy9.C compilation failed to produce executable
FAIL: g++.old-deja/g++.brendan/crash15.C (test for excess errors)
FAIL: g++.old-deja/g++.brendan/crash20.C (test for excess errors)
FAIL: g++.old-deja/g++.brendan/crash30.C (test for excess errors)
FAIL: g++.old-deja/g++.brendan/crash38.C (test for excess errors)
FAIL: g++.old-deja/g++.brendan/crash49.C (test for excess errors)
FAIL: g++.old-deja/g++.brendan/crash62.C (test for excess errors)
FAIL: g++.old-deja/g++.brendan/cvt1.C (test for excess errors)
FAIL: g++.old-deja/g++.brendan/err-msg3.C (test for excess errors)
FAIL: g++.old-deja/g++.brendan/nest21.C (test for excess errors)
WARNING: g++.old-deja/g++.brendan/nest21.C compilation failed to produce executable
FAIL: g++.old-deja/g++.brendan/ptolemy2.C (test for excess errors)
WARNING: g++.old-deja/g++.brendan/ptolemy2.C compilation failed to produce executable
FAIL: g++.old-deja/g++.eh/badalloc1.C execution test
FAIL: g++.old-deja/g++.ext/attrib5.C (test for excess errors)
XPASS: g++.old-deja/g++.ext/attrib5.C execution test
FAIL: g++.old-deja/g++.jason/template24.C (test for excess errors)
WARNING: g++.old-deja/g++.jason/template24.C compilation failed to produce executable
FAIL: g++.old-deja/g++.jason/template31.C (test for excess errors)
WARNING: g++.old-deja/g++.jason/template31.C compilation failed to produce executable
FAIL: g++.old-deja/g++.jason/typeid1.C (test for excess errors)
FAIL: g++.old-deja/g++.law/arg1.C (test for excess errors)
FAIL: g++.old-deja/g++.law/arg8.C (test for excess errors)
WARNING: g++.old-deja/g++.law/arg8.C compilation failed to produce executable
FAIL: g++.old-deja/g++.law/arm12.C (test for excess errors)
FAIL: g++.old-deja/g++.law/arm9.C (test for excess errors)
FAIL: g++.old-deja/g++.law/bad-error7.C (test for excess errors)
FAIL: g++.old-deja/g++.law/code-gen5.C (test for excess errors)
WARNING: g++.old-deja/g++.law/code-gen5.C compilation failed to produce executable
FAIL: g++.old-deja/g++.law/ctors10.C (test for excess errors)
FAIL: g++.old-deja/g++.law/ctors12.C (test for excess errors)
WARNING: g++.old-deja/g++.law/ctors12.C compilation failed to produce executable
FAIL: g++.old-deja/g++.law/ctors13.C (test for excess errors)
FAIL: g++.old-deja/g++.law/ctors17.C (test for excess errors)
FAIL: g++.old-deja/g++.law/ctors6.C (test for excess errors)
FAIL: g++.old-deja/g++.law/cvt16.C (test for excess errors)
FAIL: g++.old-deja/g++.law/cvt2.C (test for excess errors)
WARNING: g++.old-deja/g++.law/cvt2.C compilation failed to produce executable
FAIL: g++.old-deja/g++.law/missed-error2.C (test for excess errors)
FAIL: g++.old-deja/g++.law/nest3.C (test for excess errors)
FAIL: g++.old-deja/g++.law/operators32.C (test for excess errors)
FAIL: g++.old-deja/g++.law/operators4.C (test for excess errors)
FAIL: g++.old-deja/g++.law/vbase1.C (test for excess errors)
FAIL: g++.old-deja/g++.law/virtual3.C (test for excess errors)
WARNING: g++.old-deja/g++.law/virtual3.C compilation failed to produce executable
FAIL: g++.old-deja/g++.law/visibility1.C (test for excess errors)
FAIL: g++.old-deja/g++.law/visibility10.C (test for excess errors)
FAIL: g++.old-deja/g++.law/visibility13.C (test for excess errors)
FAIL: g++.old-deja/g++.law/visibility17.C (test for excess errors)
FAIL: g++.old-deja/g++.law/visibility2.C (test for excess errors)
FAIL: g++.old-deja/g++.law/visibility22.C (test for excess errors)
FAIL: g++.old-deja/g++.law/visibility25.C (test for excess errors)
FAIL: g++.old-deja/g++.law/visibility7.C (test for excess errors)
FAIL: g++.old-deja/g++.martin/bitset1.C (test for excess errors)
WARNING: g++.old-deja/g++.martin/bitset1.C compilation failed to produce executable
FAIL: g++.old-deja/g++.mike/dyncast5.C execution test
FAIL: g++.old-deja/g++.mike/misc13.C execution test
FAIL: g++.old-deja/g++.mike/net39.C execution test
FAIL: g++.old-deja/g++.mike/net46.C (test for excess errors)
WARNING: g++.old-deja/g++.mike/net46.C compilation failed to produce executable
WARNING: g++.old-deja/g++.mike/p10769a.C compilation failed to produce executable
FAIL: g++.old-deja/g++.mike/p2960.C execution test
FAIL: g++.old-deja/g++.mike/p3068.C execution test
FAIL: g++.old-deja/g++.mike/p3708b.C execution test
FAIL: g++.old-deja/g++.mike/p4246.C execution test
FAIL: g++.old-deja/g++.mike/p4736b.C execution test
FAIL: g++.old-deja/g++.mike/p4736c.C execution test
FAIL: g++.old-deja/g++.mike/p658.C (test for excess errors)
WARNING: g++.old-deja/g++.mike/p658.C compilation failed to produce executable
FAIL: g++.old-deja/g++.mike/pmf2.C execution test
FAIL: g++.old-deja/g++.mike/rtti1.C (test for excess errors)
FAIL: g++.old-deja/g++.mike/virt2.C execution test
FAIL: g++.old-deja/g++.mike/virt5.C execution test
FAIL: g++.old-deja/g++.ns/koenig9.C (test for excess errors)
FAIL: g++.old-deja/g++.oliva/thunk1.C execution test
FAIL: g++.old-deja/g++.other/crash18.C (test for excess errors)
FAIL: g++.old-deja/g++.other/defarg6.C (test for excess errors)
WARNING: g++.old-deja/g++.other/enum5.C compilation failed to produce executable
FAIL: g++.old-deja/g++.other/headers1.C (test for excess errors)
WARNING: g++.old-deja/g++.other/headers1.C compilation failed to produce executable
FAIL: g++.old-deja/g++.other/inline14.C (test for excess errors)
FAIL: g++.old-deja/g++.pt/crash68.C (test for excess errors)
WARNING: g++.old-deja/g++.pt/friend44.C compilation failed to produce executable
FAIL: g++.old-deja/g++.pt/instantiate10.C (test for excess errors)
FAIL: g++.old-deja/g++.robertl/eb109.C (test for excess errors)
FAIL: g++.old-deja/g++.robertl/eb113.C (test for excess errors)
FAIL: g++.old-deja/g++.robertl/eb124.C (test for excess errors)
FAIL: g++.old-deja/g++.robertl/eb127.C (test for excess errors)
FAIL: g++.old-deja/g++.robertl/eb129.C (test for excess errors)
FAIL: g++.old-deja/g++.robertl/eb129a.C (test for excess errors)
FAIL: g++.old-deja/g++.robertl/eb15.C (test for excess errors)
FAIL: g++.old-deja/g++.robertl/eb17.C execution test
FAIL: g++.old-deja/g++.robertl/eb21.C (test for excess errors)
WARNING: g++.old-deja/g++.robertl/eb21.C compilation failed to produce executable
FAIL: g++.old-deja/g++.robertl/eb24.C (test for excess errors)
FAIL: g++.old-deja/g++.robertl/eb3.C (test for excess errors)
FAIL: g++.old-deja/g++.robertl/eb30.C (test for excess errors)
FAIL: g++.old-deja/g++.robertl/eb31.C (test for excess errors)
WARNING: g++.old-deja/g++.robertl/eb31.C compilation failed to produce executable
FAIL: g++.old-deja/g++.robertl/eb33.C (test for excess errors)
WARNING: g++.old-deja/g++.robertl/eb33.C compilation failed to produce executable
FAIL: g++.old-deja/g++.robertl/eb39.C (test for excess errors)
FAIL: g++.old-deja/g++.robertl/eb4.C (test for excess errors)
FAIL: g++.old-deja/g++.robertl/eb41.C (test for excess errors)
WARNING: g++.old-deja/g++.robertl/eb41.C compilation failed to produce executable
FAIL: g++.old-deja/g++.robertl/eb43.C (test for excess errors)
FAIL: g++.old-deja/g++.robertl/eb44.C (test for excess errors)
FAIL: g++.old-deja/g++.robertl/eb46.C (test for excess errors)
WARNING: g++.old-deja/g++.robertl/eb46.C compilation failed to produce executable
FAIL: g++.old-deja/g++.robertl/eb54.C (test for excess errors)
WARNING: g++.old-deja/g++.robertl/eb54.C compilation failed to produce executable
FAIL: g++.old-deja/g++.robertl/eb55.C (test for excess errors)
FAIL: g++.old-deja/g++.robertl/eb59.C (test for excess errors)
WARNING: g++.old-deja/g++.robertl/eb59.C compilation failed to produce executable
FAIL: g++.old-deja/g++.robertl/eb60.C (test for excess errors)
FAIL: g++.old-deja/g++.robertl/eb65.C (test for excess errors)
WARNING: g++.old-deja/g++.robertl/eb65.C compilation failed to produce executable
FAIL: g++.old-deja/g++.robertl/eb66.C (test for excess errors)
WARNING: g++.old-deja/g++.robertl/eb66.C compilation failed to produce executable
FAIL: g++.old-deja/g++.robertl/eb77.C (test for excess errors)
WARNING: g++.old-deja/g++.robertl/eb77.C compilation failed to produce executable
FAIL: g++.old-deja/g++.robertl/eb79.C (test for excess errors)
FAIL: g++.old-deja/g++.robertl/eb91.C (test for excess errors)
WARNING: g++.old-deja/g++.robertl/eb91.C compilation failed to produce executable

		=== g++ Summary ===

# of expected passes		8692
# of unexpected failures	138
# of unexpected successes	1
# of expected failures		67
# of untested testcases		15
# of unsupported tests		19
gcc version 3.4 20030731 (experimental)

		=== g77 tests ===

Running target unix
FAIL: g77.f-torture/execute/980520-1.f compilation,  -O0 

		=== g77 Summary ===

# of expected passes		1758
# of unexpected failures	1
# of untested testcases		1
gcc version 3.4 20030731 (experimental)

		=== gcc tests ===

Running target unix
UNRESOLVED: gcc.c-torture/execute/wchar_t-1.c execution,  -O0 
UNRESOLVED: gcc.c-torture/execute/wchar_t-1.c execution,  -O1 
UNRESOLVED: gcc.c-torture/execute/wchar_t-1.c execution,  -O2 
UNRESOLVED: gcc.c-torture/execute/wchar_t-1.c execution,  -O3 -fomit-frame-pointer 
UNRESOLVED: gcc.c-torture/execute/wchar_t-1.c execution,  -O3 -g 
UNRESOLVED: gcc.c-torture/execute/wchar_t-1.c execution,  -Os 
FAIL: gcc.dg/compat/vector-1 c_compat_x_tst.o compile
FAIL: gcc.dg/compat/vector-1 c_compat_y_tst.o compile
UNRESOLVED: gcc.dg/compat/vector-1 c_compat_x_tst.o-c_compat_y_tst.o link 
UNRESOLVED: gcc.dg/compat/vector-1 c_compat_x_tst.o-c_compat_y_tst.o execute 
FAIL: gcc.dg/compat/vector-2 c_compat_x_tst.o compile
FAIL: gcc.dg/compat/vector-2 c_compat_y_tst.o compile
UNRESOLVED: gcc.dg/compat/vector-2 c_compat_x_tst.o-c_compat_y_tst.o link 
UNRESOLVED: gcc.dg/compat/vector-2 c_compat_x_tst.o-c_compat_y_tst.o execute 
XPASS: gcc.dg/cpp/cmdlne-dI-M.c scan-file (^|\\n)cmdlne-dI-M.*:[^\\n]*cmdlne-dI-M.c
XPASS: gcc.dg/cpp/cmdlne-dM-M.c scan-file (^|\\n)cmdlne-dM-M[^\\n]*:[^\\n]*cmdlne-dM-M.c
FAIL: gcc.dg/20021014-1.c (test for excess errors)
WARNING: gcc.dg/20021014-1.c compilation failed to produce executable
FAIL: gcc.dg/asm-names.c (test for excess errors)
FAIL: gcc.dg/builtins-20.c (test for excess errors)
FAIL: gcc.dg/i386-bitfield1.c execution test
FAIL: gcc.dg/i386-bitfield2.c execution test
FAIL: gcc.dg/i386-pic-1.c  (test for errors, line 9)
FAIL: gcc.dg/pch/common-1.c (test for excess errors)
FAIL: gcc.dg/pch/common-1.c (test for excess errors)
FAIL: gcc.dg/pch/common-1.c (test for excess errors)
FAIL: gcc.dg/pch/common-1.c (test for excess errors)
FAIL: gcc.dg/pch/common-1.c (test for excess errors)
FAIL: gcc.dg/pch/common-1.c (test for excess errors)
FAIL: gcc.dg/pch/common-1.c (test for excess errors)
FAIL: gcc.dg/pch/cpp-1.c (test for excess errors)
FAIL: gcc.dg/pch/cpp-1.c (test for excess errors)
FAIL: gcc.dg/pch/cpp-1.c (test for excess errors)
FAIL: gcc.dg/pch/cpp-1.c (test for excess errors)
FAIL: gcc.dg/pch/cpp-1.c (test for excess errors)
FAIL: gcc.dg/pch/cpp-1.c (test for excess errors)
FAIL: gcc.dg/pch/cpp-1.c (test for excess errors)
FAIL: gcc.dg/pch/cpp-2.c (test for excess errors)
FAIL: gcc.dg/pch/cpp-2.c (test for excess errors)
FAIL: gcc.dg/pch/cpp-2.c (test for excess errors)
FAIL: gcc.dg/pch/cpp-2.c (test for excess errors)
FAIL: gcc.dg/pch/cpp-2.c (test for excess errors)
FAIL: gcc.dg/pch/cpp-2.c (test for excess errors)
FAIL: gcc.dg/pch/cpp-2.c (test for excess errors)
FAIL: gcc.dg/pch/decl-1.c (test for excess errors)
FAIL: gcc.dg/pch/decl-1.c (test for excess errors)
FAIL: gcc.dg/pch/decl-1.c (test for excess errors)
FAIL: gcc.dg/pch/decl-1.c (test for excess errors)
FAIL: gcc.dg/pch/decl-1.c (test for excess errors)
FAIL: gcc.dg/pch/decl-1.c (test for excess errors)
FAIL: gcc.dg/pch/decl-1.c (test for excess errors)
FAIL: gcc.dg/pch/decl-2.c (test for excess errors)
FAIL: gcc.dg/pch/decl-2.c (test for excess errors)
FAIL: gcc.dg/pch/decl-2.c (test for excess errors)
FAIL: gcc.dg/pch/decl-2.c (test for excess errors)
FAIL: gcc.dg/pch/decl-2.c (test for excess errors)
FAIL: gcc.dg/pch/decl-2.c (test for excess errors)
FAIL: gcc.dg/pch/decl-2.c (test for excess errors)
FAIL: gcc.dg/pch/decl-3.c (test for excess errors)
FAIL: gcc.dg/pch/decl-3.c (test for excess errors)
FAIL: gcc.dg/pch/decl-3.c (test for excess errors)
FAIL: gcc.dg/pch/decl-3.c (test for excess errors)
FAIL: gcc.dg/pch/decl-3.c (test for excess errors)
FAIL: gcc.dg/pch/decl-3.c (test for excess errors)
FAIL: gcc.dg/pch/decl-3.c (test for excess errors)
FAIL: gcc.dg/pch/decl-4.c (test for excess errors)
FAIL: gcc.dg/pch/decl-4.c (test for excess errors)
FAIL: gcc.dg/pch/decl-4.c (test for excess errors)
FAIL: gcc.dg/pch/decl-4.c (test for excess errors)
FAIL: gcc.dg/pch/decl-4.c (test for excess errors)
FAIL: gcc.dg/pch/decl-4.c (test for excess errors)
FAIL: gcc.dg/pch/decl-4.c (test for excess errors)
FAIL: gcc.dg/pch/decl-5.c (test for excess errors)
FAIL: gcc.dg/pch/decl-5.c (test for excess errors)
FAIL: gcc.dg/pch/decl-5.c (test for excess errors)
FAIL: gcc.dg/pch/decl-5.c (test for excess errors)
FAIL: gcc.dg/pch/decl-5.c (test for excess errors)
FAIL: gcc.dg/pch/decl-5.c (test for excess errors)
FAIL: gcc.dg/pch/decl-5.c (test for excess errors)
FAIL: gcc.dg/pch/empty.c (test for excess errors)
FAIL: gcc.dg/pch/empty.c (test for excess errors)
FAIL: gcc.dg/pch/empty.c (test for excess errors)
FAIL: gcc.dg/pch/empty.c (test for excess errors)
FAIL: gcc.dg/pch/empty.c (test for excess errors)
FAIL: gcc.dg/pch/empty.c (test for excess errors)
FAIL: gcc.dg/pch/empty.c (test for excess errors)
FAIL: gcc.dg/pch/except-1.c (test for excess errors)
FAIL: gcc.dg/pch/except-1.c (test for excess errors)
FAIL: gcc.dg/pch/except-1.c (test for excess errors)
FAIL: gcc.dg/pch/except-1.c (test for excess errors)
FAIL: gcc.dg/pch/except-1.c (test for excess errors)
FAIL: gcc.dg/pch/except-1.c (test for excess errors)
FAIL: gcc.dg/pch/except-1.c (test for excess errors)
FAIL: gcc.dg/pch/global-1.c (test for excess errors)
FAIL: gcc.dg/pch/global-1.c (test for excess errors)
FAIL: gcc.dg/pch/global-1.c (test for excess errors)
FAIL: gcc.dg/pch/global-1.c (test for excess errors)
FAIL: gcc.dg/pch/global-1.c (test for excess errors)
FAIL: gcc.dg/pch/global-1.c (test for excess errors)
FAIL: gcc.dg/pch/global-1.c (test for excess errors)
FAIL: gcc.dg/pch/inline-1.c (test for excess errors)
FAIL: gcc.dg/pch/inline-1.c (test for excess errors)
FAIL: gcc.dg/pch/inline-1.c (test for excess errors)
FAIL: gcc.dg/pch/inline-1.c (test for excess errors)
FAIL: gcc.dg/pch/inline-1.c (test for excess errors)
FAIL: gcc.dg/pch/inline-1.c (test for excess errors)
FAIL: gcc.dg/pch/inline-1.c (test for excess errors)
FAIL: gcc.dg/pch/inline-2.c (test for excess errors)
FAIL: gcc.dg/pch/inline-2.c (test for excess errors)
FAIL: gcc.dg/pch/inline-2.c (test for excess errors)
FAIL: gcc.dg/pch/inline-2.c (test for excess errors)
FAIL: gcc.dg/pch/inline-2.c (test for excess errors)
FAIL: gcc.dg/pch/inline-2.c (test for excess errors)
FAIL: gcc.dg/pch/inline-2.c (test for excess errors)
FAIL: gcc.dg/pch/inline-3.c (test for excess errors)
FAIL: gcc.dg/pch/inline-3.c (test for excess errors)
FAIL: gcc.dg/pch/inline-3.c (test for excess errors)
FAIL: gcc.dg/pch/inline-3.c (test for excess errors)
FAIL: gcc.dg/pch/inline-3.c (test for excess errors)
FAIL: gcc.dg/pch/inline-3.c (test for excess errors)
FAIL: gcc.dg/pch/inline-3.c (test for excess errors)
FAIL: gcc.dg/pch/inline-4.c (test for excess errors)
FAIL: gcc.dg/pch/inline-4.c (test for excess errors)
FAIL: gcc.dg/pch/inline-4.c (test for excess errors)
FAIL: gcc.dg/pch/inline-4.c (test for excess errors)
FAIL: gcc.dg/pch/inline-4.c (test for excess errors)
FAIL: gcc.dg/pch/inline-4.c (test for excess errors)
FAIL: gcc.dg/pch/inline-4.c (test for excess errors)
FAIL: gcc.dg/pch/macro-1.c (test for excess errors)
FAIL: gcc.dg/pch/macro-1.c (test for excess errors)
FAIL: gcc.dg/pch/macro-1.c (test for excess errors)
FAIL: gcc.dg/pch/macro-1.c (test for excess errors)
FAIL: gcc.dg/pch/macro-1.c (test for excess errors)
FAIL: gcc.dg/pch/macro-1.c (test for excess errors)
FAIL: gcc.dg/pch/macro-1.c (test for excess errors)
FAIL: gcc.dg/pch/macro-2.c (test for excess errors)
FAIL: gcc.dg/pch/macro-2.c (test for excess errors)
FAIL: gcc.dg/pch/macro-2.c (test for excess errors)
FAIL: gcc.dg/pch/macro-2.c (test for excess errors)
FAIL: gcc.dg/pch/macro-2.c (test for excess errors)
FAIL: gcc.dg/pch/macro-2.c (test for excess errors)
FAIL: gcc.dg/pch/macro-2.c (test for excess errors)
FAIL: gcc.dg/pch/macro-3.c (test for excess errors)
FAIL: gcc.dg/pch/macro-3.c (test for excess errors)
FAIL: gcc.dg/pch/macro-3.c (test for excess errors)
FAIL: gcc.dg/pch/macro-3.c (test for excess errors)
FAIL: gcc.dg/pch/macro-3.c (test for excess errors)
FAIL: gcc.dg/pch/macro-3.c (test for excess errors)
FAIL: gcc.dg/pch/macro-3.c (test for excess errors)
FAIL: gcc.dg/pch/static-1.c (test for excess errors)
FAIL: gcc.dg/pch/static-1.c (test for excess errors)
FAIL: gcc.dg/pch/static-1.c (test for excess errors)
FAIL: gcc.dg/pch/static-1.c (test for excess errors)
FAIL: gcc.dg/pch/static-1.c (test for excess errors)
FAIL: gcc.dg/pch/static-1.c (test for excess errors)
FAIL: gcc.dg/pch/static-1.c (test for excess errors)
FAIL: gcc.dg/pch/static-2.c (test for excess errors)
FAIL: gcc.dg/pch/static-2.c (test for excess errors)
FAIL: gcc.dg/pch/static-2.c (test for excess errors)
FAIL: gcc.dg/pch/static-2.c (test for excess errors)
FAIL: gcc.dg/pch/static-2.c (test for excess errors)
FAIL: gcc.dg/pch/static-2.c (test for excess errors)
FAIL: gcc.dg/pch/static-2.c (test for excess errors)
FAIL: gcc.dg/pch/static-3.c (test for excess errors)
FAIL: gcc.dg/pch/static-3.c (test for excess errors)
FAIL: gcc.dg/pch/static-3.c (test for excess errors)
FAIL: gcc.dg/pch/static-3.c (test for excess errors)
FAIL: gcc.dg/pch/static-3.c (test for excess errors)
FAIL: gcc.dg/pch/static-3.c (test for excess errors)
FAIL: gcc.dg/pch/static-3.c (test for excess errors)
FAIL: gcc.dg/pch/system-1.c (test for excess errors)
FAIL: gcc.dg/pch/system-1.c (test for excess errors)
FAIL: gcc.dg/pch/system-1.c (test for excess errors)
FAIL: gcc.dg/pch/system-1.c (test for excess errors)
FAIL: gcc.dg/pch/system-1.c (test for excess errors)
FAIL: gcc.dg/pch/system-1.c (test for excess errors)
FAIL: gcc.dg/pch/system-1.c (test for excess errors)
FAIL: gcc.dg/torture/builtin-noret-1.c (test for excess errors)
FAIL: gcc.dg/torture/builtin-noret-1.c (test for excess errors)
FAIL: gcc.dg/torture/builtin-noret-1.c (test for excess errors)
FAIL: gcc.dg/torture/builtin-noret-1.c (test for excess errors)
FAIL: gcc.dg/torture/builtin-noret-1.c (test for excess errors)
FAIL: gcc.dg/torture/builtin-noret-1.c (test for excess errors)
FAIL: gcc.dg/torture/builtin-noret-2.c (test for excess errors)
FAIL: gcc.dg/torture/builtin-noret-2.c (test for excess errors)
FAIL: gcc.dg/torture/builtin-noret-2.c (test for excess errors)
FAIL: gcc.dg/torture/builtin-noret-2.c (test for excess errors)
FAIL: gcc.dg/torture/builtin-noret-2.c (test for excess errors)
FAIL: gcc.dg/torture/builtin-noret-2.c (test for excess errors)
FAIL: gcc.misc-tests/mg.c

		=== gcc Summary ===

# of expected passes		23432
# of unexpected failures	177
# of unexpected successes	2
# of expected failures		78
# of unresolved testcases	10
# of untested testcases		154
# of unsupported tests		145
gcc version 3.4 20030731 (experimental)

		=== objc tests ===

Running target unix

		=== objc Summary ===

# of expected passes		1156
gcc version 3.4 20030731 (experimental)

		=== libstdc++-v3 tests ===

Running target unix
FAIL: 26_numerics/c99_classification_macros_c++.cc (test for excess errors)
FAIL: 26_numerics/c99_classification_macros_c.cc (test for excess errors)
FAIL: 27_io/basic_istream/extractors_arithmetic/char/12.cc execution test

		=== libstdc++-v3 Summary ===

# of expected passes		1531
# of unexpected failures	3
# of expected failures		7

Compiler version: 3.4 20030731 (experimental) 
Platform: i686-pc-cygwin
configure flags: --prefix=/usr/local/gcc-3_4 --enable-threads=posix --disable-libgcj
--enable-sjlj-exceptions --with-system-zlib --enable-nls --disable-libstdcxx-pch
--enable-version-specific-runtime-libs --without-included-gettext --disable-shared
Counting all warnings,
there are 20 warnings in stage3 of this bootstrap.

Number of warnings per file:
      5	gcc/gcc.c
      4	insn-conditions.c
      3	gcc/unwind-sjlj.c
      2	objc/lang-specs.h
      2	gcc/f/sta.c
      1	unwind-pe.h
      1	gcc/java/jvspec.c
      1	gcc/config/i386/i386.md
      1	gcc/ada/tracebak.c

Number of warning types:
     10	string length \`???' is greater than the length \`???' ISO C89 compilers are required to support
      2	dereferencing type-punned pointer will break strict-aliasing rules
      2	assignment of read-only location
      1	unused parameter 'pc'
      1	unused parameter 'context'
      1	return makes integer from pointer without a cast
      1	operand 1 missing mode?
      1	comparison of unsigned expression < 0 is always false
      1	'size_of_encoded_value' defined but not used

Loren James Rittle | 1 Aug 03:37 2003
Picon

Results for 3.3.1 20030731 (prerelease) testsuite on i386-unknown-freebsd4.8

Using make with objdir configuration on ref4 (see key)

Bootstrap failed in libjava; attempted gmake recovery
NOTE: Failed to install without error
LAST_UPDATED: Thu Jul 31 20:53:41 GMT 2003

Native configuration is i386-unknown-freebsd4.8

		=== g++ tests ===

Running target unix/-pthread
FAIL: g++.eh/badalloc1.C  Execution test
FAIL: g++.law/profile1.C (test for excess errors)

		=== g++ Summary ===

# of expected passes		8081
# of unexpected failures	2
# of expected failures		96
# of untested testcases		12
# of unsupported tests		14
/local0/scratch/ljrittle/gcc-build-ref4-0731/gcc/testsuite/../g++ version 3.3.1 20030731 (prerelease)

		=== g77 tests ===

Running target unix/-pthread

		=== g77 Summary ===

# of expected passes		1686
# of unsupported tests		8
/local0/scratch/ljrittle/gcc-build-ref4-0731/gcc/testsuite/../g77 version 3.3.1 20030731 (prerelease)

		=== gcc tests ===

Running target unix/-pthread
FAIL: gcc.c-torture/execute/conversion.c execution,  -O0 
FAIL: gcc.c-torture/execute/conversion.c execution,  -O1 
FAIL: gcc.c-torture/execute/conversion.c execution,  -O2 
FAIL: gcc.c-torture/execute/conversion.c execution,  -Os 
FAIL: gcc.c-torture/execute/ieee/rbug.c execution,  -O3 -fomit-frame-pointer 
FAIL: gcc.c-torture/execute/ieee/rbug.c execution,  -O3 -g 
FAIL: gcc.c-torture/execute/ieee/rbug.c execution,  -O3 -fomit-frame-pointer 
FAIL: gcc.c-torture/execute/ieee/rbug.c execution,  -O3 -g 
FAIL: gcc.dg/duff-2.c (test for excess errors)
FAIL: gcc.dg/nest.c (test for excess errors)
WARNING: gcc.dg/nest.c compilation failed to produce executable
FAIL: gcc.dg/uninit-C.c (test for excess errors)
FAIL: gcc.dg/format/c99-scanf-3.c   vfscanf (test for warnings, line 21)
FAIL: gcc.dg/format/c99-scanf-3.c  -DWIDE  vfscanf (test for warnings, line 21)
FAIL: gcc.dg/format/ext-6.c   vfscanf (test for warnings, line 42)
FAIL: gcc.dg/format/ext-6.c  -DWIDE  vfscanf (test for warnings, line 42)

		=== gcc Summary ===

# of expected passes		21523
# of unexpected failures	15
# of expected failures		68
# of unsupported tests		86
/local0/scratch/ljrittle/gcc-build-ref4-0731/gcc/xgcc version 3.3.1 20030731 (prerelease)

		=== objc tests ===

Running target unix/-pthread

		=== objc Summary ===

# of expected passes		1153
/local0/scratch/ljrittle/gcc-build-ref4-0731/gcc/xgcc version 3.3.1 20030731 (prerelease)

		=== libstdc++-v3 tests ===

Running target unix

		=== libstdc++-v3 Summary ===

# of expected passes		430
# of expected failures		17

Compiler version: 3.3.1 20030731 (prerelease) 
Platform: i386-unknown-freebsd4.8
configure flags: --host=i386-unknown-freebsd4.8 --prefix=/home/ljrittle/ref4/tmp/install-ref4
--with-gnu-as --with-as=/usr/bin/as --with-gnu-ld --with-ld=/usr/bin/ld
BOOT_CFLAGS=-g -O2
Key: gmake is GNU make
     make is BSD make as shipped on i386-unknown-freebsd4.8
     srcdir means in-source configuration was done within the gcc source tree
     objdir means out-source configuration was done within a fresh directory
ref4 (3.3) and ref5 (mainline) attempt to build gcc twice daily;
once for srcdir configuration and once for objdir configuration;
odd number days use GNU make; even days use BSD make; missing
reports infer breakage; partial reports are made when bootstap
completes in gcc but fails in a support library.
beast (3.3) builds gcc once daily using gmake with objdir conf.
See http://people.freebsd.org/~ljrittle/daily-gcc-bootstrap-reports
for all related transcript logs and log.sent files (not staged
until after all daily bootstraps for a machine complete).

Kaveh R. Ghazi | 1 Aug 03:38 2003
Picon

Results for 3.4 20030731 (experimental) testsuite on mips-sgi-irix6.5

LAST_UPDATED: 
Native configuration is mips-sgi-irix6.5

		=== g++ tests ===

Running target unix
FAIL: g++.dg/abi/mangle2.C execution test
FAIL: g++.dg/expr/anew1.C execution test
FAIL: g++.dg/expr/anew2.C execution test
FAIL: g++.dg/expr/anew3.C execution test
FAIL: g++.dg/expr/anew4.C execution test
FAIL: g++.dg/ext/pretty1.C scan-assembler int bar\\(T\\).*with T = int
FAIL: g++.dg/ext/pretty1.C scan-assembler top level
FAIL: g++.dg/ext/pretty1.C scan-assembler int main\\(\\)
FAIL: g++.dg/ext/pretty1.C scan-assembler int bar\\(T\\).*with T = double
FAIL: g++.dg/ext/pretty1.C scan-assembler int bar\\(T\\).*with T = unsigned char*
FAIL: g++.dg/ext/pretty2.C (test for excess errors)
WARNING: g++.dg/ext/pretty2.C compilation failed to produce executable
FAIL: g++.dg/init/array10.C (test for excess errors)
FAIL: g++.dg/pch/system-1.C -g assembly comparison
FAIL: g++.dg/pch/system-1.C -O2 -g assembly comparison
FAIL: g++.dg/pch/system-1.C -O2 assembly comparison
FAIL: g++.dg/pch/system-2.C -g assembly comparison
FAIL: g++.dg/pch/system-2.C -O2 -g assembly comparison
FAIL: g++.dg/pch/system-2.C -O2 assembly comparison
FAIL: g++.old-deja/g++.jason/thunk3.C (test for excess errors)
WARNING: g++.old-deja/g++.jason/thunk3.C compilation failed to produce executable
FAIL: g++.old-deja/g++.law/profile1.C (test for excess errors)
WARNING: g++.old-deja/g++.law/profile1.C compilation failed to produce executable
WARNING: g++.old-deja/g++.mike/p10769a.C compilation failed to produce executable
FAIL: g++.old-deja/g++.other/comdat1.C (test for excess errors)
WARNING: g++.old-deja/g++.other/comdat1.C compilation failed to produce executable
FAIL: g++.old-deja/g++.other/comdat2.C (test for excess errors)
WARNING: g++.old-deja/g++.other/comdat2.C compilation failed to produce executable
FAIL: g++.old-deja/g++.other/comdat3.C (test for excess errors)
WARNING: g++.old-deja/g++.other/comdat3.C compilation failed to produce executable
FAIL: g++.old-deja/g++.other/crash18.C (test for excess errors)
FAIL: g++.old-deja/g++.other/ctor1.C (test for excess errors)
WARNING: g++.old-deja/g++.other/ctor1.C compilation failed to produce executable
WARNING: g++.old-deja/g++.other/enum5.C compilation failed to produce executable
WARNING: g++.old-deja/g++.pt/friend44.C compilation failed to produce executable
FAIL: g++.old-deja/g++.pt/instantiate5.C (test for excess errors)

		=== g++ Summary ===

# of expected passes		8450
# of unexpected failures	26
# of expected failures		68
# of unsupported tests		56
/caip/u58/ghazi/gcc-testing/build/gcc/testsuite/../g++ version 3.4 20030731 (experimental)

		=== g77 tests ===

Running target unix
FAIL: 238:is -:should be 3
FAIL: 242:is -:should be 9
FAIL: 241: expected branch percentages not found: 25
FAIL: g77.dg/gcov/gcov-1.f gcov: 2 failures in line counts, 1 in branch percentages, 0 in return percentages
FAIL: g77.f-torture/execute/980520-1.f compilation,  -O0 

		=== g77 Summary ===

# of expected passes		1745
# of unexpected failures	5
# of untested testcases		1
# of unsupported tests		6
/caip/u58/ghazi/gcc-testing/build/gcc/testsuite/../g77 version 3.4 20030731 (experimental)

		=== gcc tests ===

Running target unix
FAIL: gcc.c-torture/compile/mipscop-1.c (test for excess errors)
FAIL: gcc.c-torture/compile/mipscop-1.c (test for excess errors)
FAIL: gcc.c-torture/compile/mipscop-1.c (test for excess errors)
FAIL: gcc.c-torture/compile/mipscop-1.c (test for excess errors)
FAIL: gcc.c-torture/compile/mipscop-1.c (test for excess errors)
FAIL: gcc.c-torture/compile/mipscop-1.c (test for excess errors)
FAIL: gcc.c-torture/compile/mipscop-2.c (test for excess errors)
FAIL: gcc.c-torture/compile/mipscop-2.c (test for excess errors)
FAIL: gcc.c-torture/compile/mipscop-2.c (test for excess errors)
FAIL: gcc.c-torture/compile/mipscop-2.c (test for excess errors)
FAIL: gcc.c-torture/compile/mipscop-2.c (test for excess errors)
FAIL: gcc.c-torture/compile/mipscop-2.c (test for excess errors)
FAIL: gcc.c-torture/compile/mipscop-3.c (test for excess errors)
FAIL: gcc.c-torture/compile/mipscop-3.c (test for excess errors)
FAIL: gcc.c-torture/compile/mipscop-3.c (test for excess errors)
FAIL: gcc.c-torture/compile/mipscop-3.c (test for excess errors)
FAIL: gcc.c-torture/compile/mipscop-3.c (test for excess errors)
FAIL: gcc.c-torture/compile/mipscop-3.c (test for excess errors)
FAIL: gcc.c-torture/compile/mipscop-4.c (test for excess errors)
FAIL: gcc.c-torture/compile/mipscop-4.c (test for excess errors)
FAIL: gcc.c-torture/compile/mipscop-4.c (test for excess errors)
FAIL: gcc.c-torture/compile/mipscop-4.c (test for excess errors)
FAIL: gcc.c-torture/compile/mipscop-4.c (test for excess errors)
FAIL: gcc.c-torture/compile/mipscop-4.c (test for excess errors)
FAIL: gcc.c-torture/compile/simd-5.c (test for excess errors)
FAIL: gcc.c-torture/compile/simd-5.c (test for excess errors)
FAIL: gcc.c-torture/compile/simd-5.c (test for excess errors)
FAIL: gcc.c-torture/compile/simd-5.c (test for excess errors)
FAIL: gcc.c-torture/execute/20020412-1.c execution,  -O0 
FAIL: gcc.c-torture/execute/20020412-1.c execution,  -O1 
FAIL: gcc.c-torture/execute/20020412-1.c execution,  -O2 
FAIL: gcc.c-torture/execute/20020412-1.c execution,  -O3 -fomit-frame-pointer 
FAIL: gcc.c-torture/execute/20020412-1.c execution,  -O3 -fomit-frame-pointer -funroll-loops 
FAIL: gcc.c-torture/execute/20020412-1.c execution,  -O3 -fomit-frame-pointer -funroll-all-loops
-finline-functions 
FAIL: gcc.c-torture/execute/20020412-1.c execution,  -O3 -g 
FAIL: gcc.c-torture/execute/20020412-1.c execution,  -Os 
UNRESOLVED: gcc.c-torture/execute/wchar_t-1.c execution,  -O0 
UNRESOLVED: gcc.c-torture/execute/wchar_t-1.c execution,  -O1 
UNRESOLVED: gcc.c-torture/execute/wchar_t-1.c execution,  -O2 
UNRESOLVED: gcc.c-torture/execute/wchar_t-1.c execution,  -O3 -fomit-frame-pointer 
UNRESOLVED: gcc.c-torture/execute/wchar_t-1.c execution,  -O3 -g 
UNRESOLVED: gcc.c-torture/execute/wchar_t-1.c execution,  -Os 
FAIL: gcc.dg/compat/struct-by-value-11 c_compat_x_tst.o-c_compat_y_tst.o execute 
FAIL: gcc.dg/compat/struct-by-value-12 c_compat_x_tst.o-c_compat_y_tst.o execute 
FAIL: gcc.dg/compat/struct-by-value-2 c_compat_x_tst.o-c_compat_y_tst.o execute 
FAIL: gcc.dg/compat/struct-by-value-3 c_compat_x_tst.o-c_compat_y_tst.o execute 
FAIL: gcc.dg/compat/struct-by-value-4 c_compat_x_tst.o-c_compat_y_tst.o execute 
FAIL: gcc.dg/compat/struct-by-value-5 c_compat_x_tst.o-c_compat_y_tst.o execute 
FAIL: gcc.dg/compat/struct-by-value-8 c_compat_x_tst.o-c_compat_y_tst.o execute 
FAIL: gcc.dg/compat/struct-by-value-9 c_compat_x_tst.o-c_compat_y_tst.o execute 
FAIL: gcc.dg/compat/struct-return-2 c_compat_x_tst.o-c_compat_y_tst.o execute 
FAIL: gcc.dg/compat/struct-return-3 c_compat_x_tst.o-c_compat_y_tst.o execute 
FAIL: gcc.dg/compat/vector-1 c_compat_x_tst.o compile
FAIL: gcc.dg/compat/vector-1 c_compat_y_tst.o compile
UNRESOLVED: gcc.dg/compat/vector-1 c_compat_x_tst.o-c_compat_y_tst.o link 
UNRESOLVED: gcc.dg/compat/vector-1 c_compat_x_tst.o-c_compat_y_tst.o execute 
FAIL: gcc.dg/compat/vector-2 c_compat_x_tst.o compile
FAIL: gcc.dg/compat/vector-2 c_compat_y_tst.o compile
UNRESOLVED: gcc.dg/compat/vector-2 c_compat_x_tst.o-c_compat_y_tst.o link 
UNRESOLVED: gcc.dg/compat/vector-2 c_compat_x_tst.o-c_compat_y_tst.o execute 
FAIL: gcc.dg/cpp/19990228-1.c scan-file-not [^\\n]#
FAIL: gcc.dg/cpp/_Pragma4.c scan-file (^|\\n)#pragma bar(\$|\\n)
FAIL: gcc.dg/cpp/avoidpaste2.c scan-file (^|\\n): : : - > - >
FAIL: gcc.dg/cpp/avoidpaste2.c scan-file (^|\\n):2: :22 22:
FAIL: gcc.dg/cpp/cmdlne-dD-dM.c scan-file (^|\\n)#define foo bar(\$|\\n)
FAIL: gcc.dg/cpp/cmdlne-dM-M.c scan-file (^|\\n)#define foo bar(\$|\\n)
FAIL: gcc.dg/cpp/cmdlne-dM-dD.c scan-file (^|\\n)#define foo bar(\$|\\n)
FAIL: gcc.dg/cpp/maccom1.c scan-file (^|\\n)passed
WARNING: gcc.dg/20021014-1.c compilation failed to produce executable
FAIL: gcc.dg/builtins-10.c (test for excess errors)
FAIL: gcc.dg/builtins-18.c (test for excess errors)
FAIL: gcc.dg/builtins-20.c (test for excess errors)
ERROR: gcc.dg/const-elim-2.c: error executing dg-final: bad switch "-inline": must be -indices,
-nocase, or --
UNRESOLVED: gcc.dg/const-elim-2.c: error executing dg-final: bad switch "-inline": must be -indices,
-nocase, or --
WARNING: gcc.dg/nest.c compilation failed to produce executable
XPASS: gcc.dg/sibcall-3.c execution test
XPASS: gcc.dg/sibcall-4.c execution test
FAIL: gcc.dg/unused-5.c scan-assembler string_to_look_for
FAIL: gcc.dg/pch/static-1.c  -O0  assembly comparison
FAIL: gcc.dg/pch/static-1.c  -O1  assembly comparison
FAIL: gcc.dg/pch/static-1.c  -O2  assembly comparison
FAIL: gcc.dg/pch/static-1.c  -Os  assembly comparison
FAIL: gcc.dg/pch/static-2.c  -O0  assembly comparison
FAIL: gcc.dg/pch/static-2.c  -O1  assembly comparison
FAIL: gcc.dg/pch/static-2.c  -O2  assembly comparison
FAIL: gcc.dg/pch/static-2.c  -Os  assembly comparison
FAIL: gcc.dg/pch/static-3.c  -O0  assembly comparison
FAIL: gcc.dg/pch/static-3.c  -O1  assembly comparison
FAIL: gcc.dg/pch/static-3.c  -O2  assembly comparison
FAIL: gcc.dg/pch/static-3.c  -Os  assembly comparison
FAIL: gcc.dg/special/wkali-2.c (test for excess errors)
FAIL: gcc.dg/special/wkali-2.c execution test
FAIL: gcc.misc-tests/mg.c

		=== gcc Summary ===

# of expected passes		22635
# of unexpected failures	77
# of unexpected successes	2
# of expected failures		85
# of unresolved testcases	11
# of unsupported tests		236
/caip/u58/ghazi/gcc-testing/build/gcc/xgcc version 3.4 20030731 (experimental)

		=== objc tests ===

Running target unix

		=== objc Summary ===

# of expected passes		1156
/caip/u58/ghazi/gcc-testing/build/gcc/xgcc version 3.4 20030731 (experimental)

		=== libstdc++-v3 tests ===

Running target unix
FAIL: 22_locale/ctype/cons/char/1.cc execution test
FAIL: 23_containers/vector_bool.cc (test for excess errors)
WARNING: 23_containers/vector_bool.cc compilation failed to produce executable
FAIL: 27_io/basic_filebuf/sgetn/char/1-in.cc execution test
FAIL: 27_io/basic_filebuf/sgetn/char/1-io.cc execution test
FAIL: 27_io/basic_filebuf/sgetn/char/2-in.cc execution test
FAIL: 27_io/basic_filebuf/sgetn/char/2-io.cc execution test
FAIL: 27_io/basic_istream/readsome/char/6746-2.cc execution test

		=== libstdc++-v3 Summary ===

# of expected passes		1519
# of unexpected failures	7
# of unsupported tests		7

Compiler version: 3.4 20030731 (experimental) 
Platform: mips-sgi-irix6.5
configure flags: --verbose --enable-languages=c,objc,c++,f77,java

Kaveh R. Ghazi | 1 Aug 03:39 2003
Picon

Results for 3.3.1 20030730 (prerelease) testsuite on mips-sgi-irix6.5

LAST_UPDATED: 
Native configuration is mips-sgi-irix6.5

		=== g++ tests ===

Running target unix/-mabi=64
FAIL: g++.dg/expr/anew1.C execution test
FAIL: g++.dg/expr/anew2.C execution test
FAIL: g++.dg/expr/anew3.C execution test
FAIL: g++.dg/expr/anew4.C execution test

		=== g++ Summary for unix/-mabi=64 ===

# of expected passes		7782
# of unexpected failures	4
# of expected failures		104
# of untested testcases		23
# of unsupported tests		28

Running target unix/-mips4
FAIL: g++.dg/expr/anew1.C execution test
FAIL: g++.dg/expr/anew2.C execution test
FAIL: g++.dg/expr/anew3.C execution test
FAIL: g++.dg/expr/anew4.C execution test

		=== g++ Summary for unix/-mips4 ===

# of expected passes		7782
# of unexpected failures	4
# of expected failures		104
# of untested testcases		23
# of unsupported tests		28

Running target unix
FAIL: g++.dg/expr/anew1.C execution test
FAIL: g++.dg/expr/anew2.C execution test
FAIL: g++.dg/expr/anew3.C execution test
FAIL: g++.dg/expr/anew4.C execution test

		=== g++ Summary for unix ===

# of expected passes		7782
# of unexpected failures	4
# of expected failures		104
# of untested testcases		23
# of unsupported tests		28

		=== g++ Summary ===

# of expected passes		23346
# of unexpected failures	12
# of expected failures		312
# of untested testcases		69
# of unsupported tests		84
/caip/u58/ghazi/gcc-testing/branch/build/gcc/testsuite/../g++ version 3.3.1 20030730 (prerelease)

		=== g77 tests ===

Running target unix/-mabi=64
FAIL: g77.f-torture/execute/6367.f execution,  -O0 
FAIL: g77.f-torture/execute/6367.f execution,  -O1 
FAIL: g77.f-torture/execute/6367.f execution,  -O2 
FAIL: g77.f-torture/execute/6367.f execution,  -O3 -fomit-frame-pointer 
FAIL: g77.f-torture/execute/6367.f execution,  -O3 -fomit-frame-pointer -funroll-loops 
FAIL: g77.f-torture/execute/6367.f execution,  -O3 -fomit-frame-pointer -funroll-all-loops
-finline-functions 
FAIL: g77.f-torture/execute/6367.f execution,  -O3 -g 
FAIL: g77.f-torture/execute/6367.f execution,  -Os 
FAIL: g77.f-torture/execute/970625-2.f execution,  -O0 
FAIL: g77.f-torture/execute/970625-2.f execution,  -O1 
FAIL: g77.f-torture/execute/970625-2.f execution,  -O2 
FAIL: g77.f-torture/execute/970625-2.f execution,  -O3 -fomit-frame-pointer 
FAIL: g77.f-torture/execute/970625-2.f execution,  -O3 -fomit-frame-pointer -funroll-loops 
FAIL: g77.f-torture/execute/970625-2.f execution,  -O3 -fomit-frame-pointer -funroll-all-loops
-finline-functions 
FAIL: g77.f-torture/execute/970625-2.f execution,  -O3 -g 
FAIL: g77.f-torture/execute/970625-2.f execution,  -Os 
FAIL: g77.f-torture/execute/auto0.f execution,  -O0 
FAIL: g77.f-torture/execute/auto0.f execution,  -O1 
FAIL: g77.f-torture/execute/auto0.f execution,  -O2 
FAIL: g77.f-torture/execute/auto0.f execution,  -O3 -fomit-frame-pointer 
FAIL: g77.f-torture/execute/auto0.f execution,  -O3 -fomit-frame-pointer -funroll-loops 
FAIL: g77.f-torture/execute/auto0.f execution,  -O3 -fomit-frame-pointer -funroll-all-loops
-finline-functions 
FAIL: g77.f-torture/execute/auto0.f execution,  -O3 -g 
FAIL: g77.f-torture/execute/auto0.f execution,  -Os 
FAIL: g77.f-torture/execute/auto1.f execution,  -O0 
FAIL: g77.f-torture/execute/auto1.f execution,  -O1 
FAIL: g77.f-torture/execute/auto1.f execution,  -O2 
FAIL: g77.f-torture/execute/auto1.f execution,  -O3 -fomit-frame-pointer 
FAIL: g77.f-torture/execute/auto1.f execution,  -O3 -fomit-frame-pointer -funroll-loops 
FAIL: g77.f-torture/execute/auto1.f execution,  -O3 -fomit-frame-pointer -funroll-all-loops
-finline-functions 
FAIL: g77.f-torture/execute/auto1.f execution,  -O3 -g 
FAIL: g77.f-torture/execute/auto1.f execution,  -Os 

		=== g77 Summary for unix/-mabi=64 ===

# of expected passes		1654
# of unexpected failures	32
# of unsupported tests		8

Running target unix/-mips4

		=== g77 Summary for unix/-mips4 ===

# of expected passes		1686
# of unsupported tests		8

Running target unix

		=== g77 Summary for unix ===

# of expected passes		1686
# of unsupported tests		8

		=== g77 Summary ===

# of expected passes		5026
# of unexpected failures	32
# of unsupported tests		24
/caip/u58/ghazi/gcc-testing/branch/build/gcc/testsuite/../g77 version 3.3.1 20030730 (prerelease)

		=== gcc tests ===

Running target unix/-mabi=64
FAIL: gcc.c-torture/execute/20020412-1.c execution,  -O0 
FAIL: gcc.c-torture/execute/20020412-1.c execution,  -O1 
FAIL: gcc.c-torture/execute/20020412-1.c execution,  -O2 
FAIL: gcc.c-torture/execute/20020412-1.c execution,  -O3 -fomit-frame-pointer 
FAIL: gcc.c-torture/execute/20020412-1.c execution,  -O3 -fomit-frame-pointer -funroll-loops 
FAIL: gcc.c-torture/execute/20020412-1.c execution,  -O3 -fomit-frame-pointer -funroll-all-loops
-finline-functions 
FAIL: gcc.c-torture/execute/20020412-1.c execution,  -O3 -g 
FAIL: gcc.c-torture/execute/20020412-1.c execution,  -Os 
WARNING: gcc.dg/20021014-1.c compilation failed to produce executable
FAIL: gcc.dg/duff-2.c (test for excess errors)
WARNING: gcc.dg/nest.c compilation failed to produce executable

		=== gcc Summary for unix/-mabi=64 ===

# of expected passes		20505
# of unexpected failures	9
# of expected failures		100
# of unsupported tests		181

Running target unix/-mips4
FAIL: gcc.c-torture/execute/20020412-1.c execution,  -O0 
FAIL: gcc.c-torture/execute/20020412-1.c execution,  -O1 
FAIL: gcc.c-torture/execute/20020412-1.c execution,  -O2 
FAIL: gcc.c-torture/execute/20020412-1.c execution,  -O3 -fomit-frame-pointer 
FAIL: gcc.c-torture/execute/20020412-1.c execution,  -O3 -fomit-frame-pointer -funroll-loops 
FAIL: gcc.c-torture/execute/20020412-1.c execution,  -O3 -fomit-frame-pointer -funroll-all-loops
-finline-functions 
FAIL: gcc.c-torture/execute/20020412-1.c execution,  -O3 -g 
FAIL: gcc.c-torture/execute/20020412-1.c execution,  -Os 
WARNING: gcc.dg/20021014-1.c compilation failed to produce executable
FAIL: gcc.dg/duff-2.c (test for excess errors)
WARNING: gcc.dg/nest.c compilation failed to produce executable

		=== gcc Summary for unix/-mips4 ===

# of expected passes		20505
# of unexpected failures	9
# of expected failures		100
# of unsupported tests		181

Running target unix
FAIL: gcc.c-torture/execute/20020412-1.c execution,  -O0 
FAIL: gcc.c-torture/execute/20020412-1.c execution,  -O1 
FAIL: gcc.c-torture/execute/20020412-1.c execution,  -O2 
FAIL: gcc.c-torture/execute/20020412-1.c execution,  -O3 -fomit-frame-pointer 
FAIL: gcc.c-torture/execute/20020412-1.c execution,  -O3 -fomit-frame-pointer -funroll-loops 
FAIL: gcc.c-torture/execute/20020412-1.c execution,  -O3 -fomit-frame-pointer -funroll-all-loops
-finline-functions 
FAIL: gcc.c-torture/execute/20020412-1.c execution,  -O3 -g 
FAIL: gcc.c-torture/execute/20020412-1.c execution,  -Os 
WARNING: gcc.dg/20021014-1.c compilation failed to produce executable
FAIL: gcc.dg/duff-2.c (test for excess errors)
WARNING: gcc.dg/nest.c compilation failed to produce executable

		=== gcc Summary for unix ===

# of expected passes		20505
# of unexpected failures	9
# of expected failures		100
# of unsupported tests		181

		=== gcc Summary ===

# of expected passes		61515
# of unexpected failures	27
# of expected failures		300
# of unsupported tests		543
/caip/u58/ghazi/gcc-testing/branch/build/gcc/xgcc version 3.3.1 20030730 (prerelease)

		=== objc tests ===

Running target unix/-mabi=64

		=== objc Summary for unix/-mabi=64 ===

# of expected passes		1153

Running target unix/-mips4

		=== objc Summary for unix/-mips4 ===

# of expected passes		1153

Running target unix

		=== objc Summary for unix ===

# of expected passes		1153

		=== objc Summary ===

# of expected passes		3459
/caip/u58/ghazi/gcc-testing/branch/build/gcc/xgcc version 3.3.1 20030730 (prerelease)

		=== libstdc++-v3 tests ===

Running target unix/-mabi=64
FAIL: 27_io/istream_unformatted.cc execution test

		=== libstdc++-v3 Summary for unix/-mabi=64 ===

# of expected passes		417
# of unexpected failures	1
# of expected failures		17
# of unsupported tests		6

Running target unix/-mips4
FAIL: 27_io/istream_unformatted.cc execution test

		=== libstdc++-v3 Summary for unix/-mips4 ===

# of expected passes		417
# of unexpected failures	1
# of expected failures		17
# of unsupported tests		6

Running target unix
FAIL: 27_io/istream_unformatted.cc execution test

		=== libstdc++-v3 Summary for unix ===

# of expected passes		417
# of unexpected failures	1
# of expected failures		17
# of unsupported tests		6

		=== libstdc++-v3 Summary ===

# of expected passes		1251
# of unexpected failures	3
# of expected failures		51
# of unsupported tests		18

Compiler version: 3.3.1 20030730 (prerelease) 
Platform: mips-sgi-irix6.5
configure flags: --host=mips-sgi-irix6.5 --verbose --enable-languages=c,objc,c++,f77,java

Kaveh R. Ghazi | 1 Aug 03:40 2003
Picon

Results for 3.4 20030731 (experimental) testsuite on sparc-sun-solaris2.7

LAST_UPDATED: 
Native configuration is sparc-sun-solaris2.7

		=== g++ tests ===

Running target unix
FAIL: g++.dg/eh/simd-1.C (test for excess errors)
WARNING: g++.dg/eh/simd-1.C compilation failed to produce executable
FAIL: g++.dg/eh/simd-2.C (test for excess errors)
WARNING: g++.dg/eh/simd-2.C compilation failed to produce executable
FAIL: g++.dg/ext/pretty1.C scan-assembler top level
FAIL: g++.dg/ext/pretty2.C (test for excess errors)
WARNING: g++.dg/ext/pretty2.C compilation failed to produce executable
FAIL: g++.dg/init/array10.C (test for excess errors)
FAIL: g++.dg/special/conpr-4.C execution test
WARNING: g++.old-deja/g++.mike/p10769a.C compilation failed to produce executable
FAIL: g++.old-deja/g++.other/comdat1.C (test for excess errors)
WARNING: g++.old-deja/g++.other/comdat1.C compilation failed to produce executable
FAIL: g++.old-deja/g++.other/comdat2.C (test for excess errors)
WARNING: g++.old-deja/g++.other/comdat2.C compilation failed to produce executable
FAIL: g++.old-deja/g++.other/comdat3.C (test for excess errors)
WARNING: g++.old-deja/g++.other/comdat3.C compilation failed to produce executable
FAIL: g++.old-deja/g++.other/crash18.C (test for excess errors)
FAIL: g++.old-deja/g++.other/ctor1.C (test for excess errors)
WARNING: g++.old-deja/g++.other/ctor1.C compilation failed to produce executable
WARNING: g++.old-deja/g++.other/enum5.C compilation failed to produce executable
WARNING: g++.old-deja/g++.pt/friend44.C compilation failed to produce executable
FAIL: g++.old-deja/g++.pt/instantiate5.C (test for excess errors)

		=== g++ Summary ===

# of expected passes		8770
# of unexpected failures	12
# of expected failures		70
# of unsupported tests		52
/teal/tmpdisk/ghazi/gcc-testing/34/build/gcc/testsuite/../g++ version 3.4 20030731 (experimental)

		=== g77 tests ===

Running target unix
FAIL: g77.f-torture/execute/980520-1.f compilation,  -O0 

		=== g77 Summary ===

# of expected passes		1746
# of unexpected failures	1
# of untested testcases		1
# of unsupported tests		6
/teal/tmpdisk/ghazi/gcc-testing/34/build/gcc/testsuite/../g77 version 3.4 20030731 (experimental)

		=== gcc tests ===

Running target unix
FAIL: gcc.c-torture/execute/simd-4.c compilation,  -O0 
UNRESOLVED: gcc.c-torture/execute/simd-4.c execution,  -O0 
FAIL: gcc.c-torture/execute/simd-4.c compilation,  -O1 
UNRESOLVED: gcc.c-torture/execute/simd-4.c execution,  -O1 
FAIL: gcc.c-torture/execute/simd-4.c compilation,  -O2 
UNRESOLVED: gcc.c-torture/execute/simd-4.c execution,  -O2 
FAIL: gcc.c-torture/execute/simd-4.c compilation,  -Os 
UNRESOLVED: gcc.c-torture/execute/simd-4.c execution,  -Os 
UNRESOLVED: gcc.c-torture/execute/wchar_t-1.c execution,  -O0 
UNRESOLVED: gcc.c-torture/execute/wchar_t-1.c execution,  -O1 
UNRESOLVED: gcc.c-torture/execute/wchar_t-1.c execution,  -O2 
UNRESOLVED: gcc.c-torture/execute/wchar_t-1.c execution,  -O3 -fomit-frame-pointer 
UNRESOLVED: gcc.c-torture/execute/wchar_t-1.c execution,  -O3 -g 
UNRESOLVED: gcc.c-torture/execute/wchar_t-1.c execution,  -Os 
FAIL: gcc.dg/compat/vector-1 c_compat_x_tst.o compile
FAIL: gcc.dg/compat/vector-1 c_compat_y_tst.o compile
UNRESOLVED: gcc.dg/compat/vector-1 c_compat_x_tst.o-c_compat_y_tst.o link 
UNRESOLVED: gcc.dg/compat/vector-1 c_compat_x_tst.o-c_compat_y_tst.o execute 
FAIL: gcc.dg/compat/vector-2 c_compat_x_tst.o compile
FAIL: gcc.dg/compat/vector-2 c_compat_y_tst.o compile
UNRESOLVED: gcc.dg/compat/vector-2 c_compat_x_tst.o-c_compat_y_tst.o link 
UNRESOLVED: gcc.dg/compat/vector-2 c_compat_x_tst.o-c_compat_y_tst.o execute 
FAIL: gcc.dg/cpp/19990228-1.c scan-file-not [^\\n]#
FAIL: gcc.dg/cpp/_Pragma4.c scan-file (^|\\n)#pragma bar(\$|\\n)
FAIL: gcc.dg/cpp/avoidpaste2.c scan-file (^|\\n): : : - > - >
FAIL: gcc.dg/cpp/avoidpaste2.c scan-file (^|\\n):2: :22 22:
FAIL: gcc.dg/cpp/cmdlne-dD-dM.c scan-file (^|\\n)#define foo bar(\$|\\n)
FAIL: gcc.dg/cpp/cmdlne-dM-M.c scan-file (^|\\n)#define foo bar(\$|\\n)
FAIL: gcc.dg/cpp/cmdlne-dM-dD.c scan-file (^|\\n)#define foo bar(\$|\\n)
FAIL: gcc.dg/cpp/maccom1.c scan-file (^|\\n)passed
WARNING: gcc.dg/20021014-1.c compilation failed to produce executable
FAIL: gcc.dg/builtins-18.c (test for excess errors)
FAIL: gcc.dg/builtins-20.c (test for excess errors)
ERROR: gcc.dg/const-elim-2.c: error executing dg-final: bad switch "-inline": must be -indices,
-nocase, or --
UNRESOLVED: gcc.dg/const-elim-2.c: error executing dg-final: bad switch "-inline": must be -indices,
-nocase, or --
XPASS: gcc.dg/uninit-4.c uninitialized variable warning (test for bogus messages, line 26)
FAIL: gcc.misc-tests/mg.c

		=== gcc Summary ===

# of expected passes		23025
# of unexpected failures	19
# of unexpected successes	1
# of expected failures		78
# of unresolved testcases	15
# of unsupported tests		249
/teal/tmpdisk/ghazi/gcc-testing/34/build/gcc/xgcc version 3.4 20030731 (experimental)

		=== objc tests ===

Running target unix

		=== objc Summary ===

# of expected passes		1156
/teal/tmpdisk/ghazi/gcc-testing/34/build/gcc/xgcc version 3.4 20030731 (experimental)

		=== libstdc++-v3 tests ===

Running target unix
FAIL: 27_io/basic_istream/sentry/char/3983-fstream.cc (test for excess errors)
WARNING: 27_io/basic_istream/sentry/char/3983-fstream.cc compilation failed to produce executable
FAIL: 27_io/basic_istream/sentry/char/3983-sstream.cc (test for excess errors)
WARNING: 27_io/basic_istream/sentry/char/3983-sstream.cc compilation failed to produce executable
FAIL: 27_io/basic_ostream/sentry/char/3983-fstream.cc (test for excess errors)
WARNING: 27_io/basic_ostream/sentry/char/3983-fstream.cc compilation failed to produce executable
FAIL: 27_io/basic_ostream/sentry/char/3983-sstream.cc (test for excess errors)
WARNING: 27_io/basic_ostream/sentry/char/3983-sstream.cc compilation failed to produce executable

		=== libstdc++-v3 Summary ===

# of expected passes		1532
# of unexpected failures	4
# of expected failures		1

Compiler version: 3.4 20030731 (experimental) 
Platform: sparc-sun-solaris2.7
configure flags: --verbose --enable-languages=c,objc,c++,f77


Gmane