Regression Tester | 1 Jul 01:07 2003
Picon

Results for 3.3.1 20030630 (prerelease) testsuite on powerpc-apple-darwin6.3

LAST_UPDATED: 
Native configuration is powerpc-apple-darwin6.3

		=== g++ tests ===

Running target unix
FAIL: g++.dg/eh/cleanup1.C (test for excess errors)
XPASS: g++.dg/other/packed1.C execution test
FAIL: g++.dg/parse/stack1.C (test for excess errors)
FAIL: g++.dg/template/inline1.C scan-assembler-not _ZN1X3FooIiEEvT_:
FAIL: g++.dg/warn/weak1.C (test for excess errors)
FAIL: g++.dg/special/conpr-3.C execution test
XPASS: g++.eh/badalloc1.C  Execution test
FAIL: g++.ext/attrib5.C (test for excess errors)
FAIL: g++.law/ctors2.C  Execution test
FAIL: g++.other/comdat3.C (test for excess errors)
FAIL: g++.other/mangle3.C (test for excess errors)
FAIL: g++.pt/instantiate12.C  Execution test
FAIL: g++.pt/static3.C (test for excess errors)
FAIL: g++.pt/static6.C (test for excess errors)

		=== g++ Summary ===

# of expected passes		7841
# of unexpected failures	12
# of unexpected successes	2
# of expected failures		99
# of untested testcases		23
# of unsupported tests		18
/Users/regress/tbox/native/build/gcc/testsuite/../g++ version 3.3.1 20030630 (prerelease)
(Continue reading)

Robert Schiele | 1 Jul 01:40 2003
Picon

Results for 3.3.1 20030630 (prerelease) testsuite on i486-suse-linux-gnu

Attachment: application/octet-stream, 3363 bytes
regress | 1 Jul 01:40 2003
Picon

Results for 3.4 20030630 (experimental) testsuite on powerpc-apple-darwin6.3

LAST_UPDATED: 
Native configuration is powerpc-apple-darwin6.3

		=== g++ tests ===

Running target unix
FAIL: g++.dg/eh/cleanup1.C (test for excess errors)
FAIL: g++.dg/eh/simd-2.C (test for excess errors)
WARNING: g++.dg/eh/simd-2.C compilation failed to produce executable
FAIL: g++.dg/ext/pretty1.C scan-assembler top level
FAIL: g++.dg/ext/pretty2.C (test for excess errors)
WARNING: g++.dg/ext/pretty2.C compilation failed to produce executable
FAIL: g++.dg/init/array10.C (test for excess errors)
XPASS: g++.dg/other/packed1.C execution test
FAIL: g++.dg/parse/attr-ctor1.C (test for excess errors)
FAIL: g++.dg/parse/stack1.C (test for excess errors)
FAIL: g++.dg/template/explicit-instantiation2.C scan-assembler _Z1fIiET_S0_
FAIL: g++.dg/template/inline1.C scan-assembler-not _ZN1X3FooIiEEvT_:
FAIL: g++.dg/warn/weak1.C (test for excess errors)
FAIL: g++.dg/special/conpr-3.C execution test
FAIL: g++.old-deja/g++.eh/badalloc1.C (test for excess errors)
XPASS: g++.old-deja/g++.eh/badalloc1.C execution test
FAIL: g++.old-deja/g++.ext/attrib5.C (test for excess errors)
WARNING: g++.old-deja/g++.ext/attrib5.C compilation failed to produce executable
FAIL: g++.old-deja/g++.law/ctors2.C execution test
WARNING: g++.old-deja/g++.mike/p10769a.C compilation failed to produce executable
FAIL: g++.old-deja/g++.mike/p4750.C (test for excess errors)
FAIL: g++.old-deja/g++.other/comdat3.C (test for excess errors)
WARNING: g++.old-deja/g++.other/comdat3.C compilation failed to produce executable
WARNING: g++.old-deja/g++.other/enum5.C compilation failed to produce executable
FAIL: g++.old-deja/g++.other/local-alloc1.C (test for excess errors)
FAIL: g++.old-deja/g++.other/mangle3.C (test for excess errors)
WARNING: g++.old-deja/g++.pt/friend44.C compilation failed to produce executable
FAIL: g++.old-deja/g++.pt/instantiate12.C execution test
FAIL: g++.old-deja/g++.pt/static3.C (test for excess errors)
WARNING: g++.old-deja/g++.pt/static3.C compilation failed to produce executable
FAIL: g++.old-deja/g++.pt/static6.C (test for excess errors)

		=== g++ Summary ===

# of expected passes		8436
# of unexpected failures	21
# of unexpected successes	2
# of expected failures		67
# of unsupported tests		46
/Users/regress/tbox/native/build/gcc/testsuite/../g++ version 3.4 20030630 (experimental)

		=== g77 tests ===

Running target unix
FAIL: g77.f-torture/execute/980520-1.f compilation,  -O0 

		=== g77 Summary ===

# of expected passes		1746
# of unexpected failures	1
# of untested testcases		1
# of unsupported tests		6
/Users/regress/tbox/native/build/gcc/testsuite/../g77 version 3.4 20030630 (experimental)

		=== gcc tests ===

Running target unix
FAIL: gcc.c-torture/execute/20000412-3.c execution,  -O3 -fomit-frame-pointer 
FAIL: gcc.c-torture/execute/20000412-3.c execution,  -O3 -g 
FAIL: gcc.c-torture/execute/pure-1.c compilation,  -O1 
UNRESOLVED: gcc.c-torture/execute/pure-1.c execution,  -O1 
FAIL: gcc.c-torture/execute/pure-1.c compilation,  -O2 
UNRESOLVED: gcc.c-torture/execute/pure-1.c execution,  -O2 
FAIL: gcc.c-torture/execute/pure-1.c compilation,  -Os 
UNRESOLVED: gcc.c-torture/execute/pure-1.c execution,  -Os 
FAIL: gcc.dg/compat/struct-by-value-11 c_compat_x_tst.o-c_compat_y_tst.o execute 
FAIL: gcc.dg/compat/struct-by-value-1 c_compat_x_tst.o-c_compat_y_tst.o link
UNRESOLVED: gcc.dg/compat/struct-by-value-1 c_compat_x_tst.o-c_compat_y_tst.o execute 
FAIL: gcc.dg/compat/struct-by-value-2 c_compat_x_tst.o-c_compat_y_tst.o link
UNRESOLVED: gcc.dg/compat/struct-by-value-2 c_compat_x_tst.o-c_compat_y_tst.o execute 
FAIL: gcc.dg/compat/struct-by-value-3 c_compat_x_tst.o-c_compat_y_tst.o execute 
FAIL: gcc.dg/compat/struct-by-value-4 c_compat_x_tst.o-c_compat_y_tst.o link
UNRESOLVED: gcc.dg/compat/struct-by-value-4 c_compat_x_tst.o-c_compat_y_tst.o execute 
FAIL: gcc.dg/compat/struct-by-value-8 c_compat_x_tst.o-c_compat_y_tst.o link
UNRESOLVED: gcc.dg/compat/struct-by-value-8 c_compat_x_tst.o-c_compat_y_tst.o execute 
FAIL: gcc.dg/compat/struct-by-value-9 c_compat_x_tst.o-c_compat_y_tst.o link
UNRESOLVED: gcc.dg/compat/struct-by-value-9 c_compat_x_tst.o-c_compat_y_tst.o execute 
FAIL: gcc.dg/compat/struct-return-2 c_compat_x_tst.o-c_compat_y_tst.o link
UNRESOLVED: gcc.dg/compat/struct-return-2 c_compat_x_tst.o-c_compat_y_tst.o execute 
FAIL: gcc.dg/compat/struct-return-3 c_compat_x_tst.o-c_compat_y_tst.o execute 
FAIL: gcc.dg/20020425-1.c (test for excess errors)
FAIL: gcc.dg/20030626-1.c  (test for bogus messages, line 17)
FAIL: gcc.dg/builtins-18.c (test for excess errors)
FAIL: gcc.dg/builtins-20.c (test for excess errors)
FAIL: gcc.dg/c90-intconst-1.c (test for excess errors)
FAIL: gcc.dg/c99-intconst-1.c (test for excess errors)
FAIL: gcc.dg/const-elim-1.c scan-assembler-not LC[^A-Z]
FAIL: gcc.dg/struct-by-value-1.c (test for excess errors)
WARNING: gcc.dg/struct-by-value-1.c compilation failed to produce executable
FAIL: gcc.dg/warn-1.c  (test for warnings, line 15)
FAIL: gcc.dg/pch/common-1.c  -O3 -fomit-frame-pointer  assembly comparison
FAIL: gcc.dg/pch/common-1.c  -O3 -g  assembly comparison
FAIL: gcc.dg/pch/inline-1.c  -O3 -fomit-frame-pointer  assembly comparison
FAIL: gcc.dg/pch/inline-1.c  -O3 -g  assembly comparison
UNRESOLVED: gcc.dg/special/weak-1.c
UNRESOLVED: gcc.dg/special/weak-2.c
UNRESOLVED: gcc.dg/special/wkali-1.c
UNRESOLVED: gcc.dg/special/wkali-2.c
UNRESOLVED: gcc.dg/weak/typeof-2.c
UNRESOLVED: gcc.dg/weak/weak-1.c
UNRESOLVED: gcc.dg/weak/weak-2.c
UNRESOLVED: gcc.dg/weak/weak-3.c
UNRESOLVED: gcc.dg/weak/weak-4.c
UNRESOLVED: gcc.dg/weak/weak-5.c
UNRESOLVED: gcc.dg/weak/weak-6.c
UNRESOLVED: gcc.dg/weak/weak-7.c
UNRESOLVED: gcc.dg/weak/weak-8.c
UNRESOLVED: gcc.dg/weak/weak-9.c

		=== gcc Summary ===

# of expected passes		23088
# of unexpected failures	27
# of expected failures		75
# of unresolved testcases	23
# of unsupported tests		247
/Users/regress/tbox/native/build/gcc/xgcc version 3.4 20030630 (experimental)

		=== objc tests ===

Running target unix
FAIL: objc/execute/IMP.m compilation,  -O0 
UNRESOLVED: objc/execute/IMP.m execution,  -O0 
FAIL: objc/execute/IMP.m compilation,  -O1 
UNRESOLVED: objc/execute/IMP.m execution,  -O1 
FAIL: objc/execute/IMP.m compilation,  -O2 
UNRESOLVED: objc/execute/IMP.m execution,  -O2 
FAIL: objc/execute/IMP.m compilation,  -O3 -fomit-frame-pointer 
UNRESOLVED: objc/execute/IMP.m execution,  -O3 -fomit-frame-pointer 
FAIL: objc/execute/IMP.m compilation,  -O3 -g 
UNRESOLVED: objc/execute/IMP.m execution,  -O3 -g 
FAIL: objc/execute/IMP.m compilation,  -Os 
UNRESOLVED: objc/execute/IMP.m execution,  -Os 
FAIL: objc/execute/_cmd.m compilation,  -O0 
UNRESOLVED: objc/execute/_cmd.m execution,  -O0 
FAIL: objc/execute/_cmd.m compilation,  -O1 
UNRESOLVED: objc/execute/_cmd.m execution,  -O1 
FAIL: objc/execute/_cmd.m compilation,  -O2 
UNRESOLVED: objc/execute/_cmd.m execution,  -O2 
FAIL: objc/execute/_cmd.m compilation,  -O3 -fomit-frame-pointer 
UNRESOLVED: objc/execute/_cmd.m execution,  -O3 -fomit-frame-pointer 
FAIL: objc/execute/_cmd.m compilation,  -O3 -g 
UNRESOLVED: objc/execute/_cmd.m execution,  -O3 -g 
FAIL: objc/execute/_cmd.m compilation,  -Os 
UNRESOLVED: objc/execute/_cmd.m execution,  -Os 
FAIL: objc/execute/bf-1.m compilation,  -O0 
UNRESOLVED: objc/execute/bf-1.m execution,  -O0 
FAIL: objc/execute/bf-1.m compilation,  -O1 
UNRESOLVED: objc/execute/bf-1.m execution,  -O1 
FAIL: objc/execute/bf-1.m compilation,  -O2 
UNRESOLVED: objc/execute/bf-1.m execution,  -O2 
FAIL: objc/execute/bf-1.m compilation,  -O3 -fomit-frame-pointer 
UNRESOLVED: objc/execute/bf-1.m execution,  -O3 -fomit-frame-pointer 
FAIL: objc/execute/bf-1.m compilation,  -O3 -g 
UNRESOLVED: objc/execute/bf-1.m execution,  -O3 -g 
FAIL: objc/execute/bf-1.m compilation,  -Os 
UNRESOLVED: objc/execute/bf-1.m execution,  -Os 
FAIL: objc/execute/bf-10.m compilation,  -O0 
UNRESOLVED: objc/execute/bf-10.m execution,  -O0 
FAIL: objc/execute/bf-10.m compilation,  -O1 
UNRESOLVED: objc/execute/bf-10.m execution,  -O1 
FAIL: objc/execute/bf-10.m compilation,  -O2 
UNRESOLVED: objc/execute/bf-10.m execution,  -O2 
FAIL: objc/execute/bf-10.m compilation,  -O3 -fomit-frame-pointer 
UNRESOLVED: objc/execute/bf-10.m execution,  -O3 -fomit-frame-pointer 
FAIL: objc/execute/bf-10.m compilation,  -O3 -g 
UNRESOLVED: objc/execute/bf-10.m execution,  -O3 -g 
FAIL: objc/execute/bf-10.m compilation,  -Os 
UNRESOLVED: objc/execute/bf-10.m execution,  -Os 
FAIL: objc/execute/bf-11.m compilation,  -O0 
UNRESOLVED: objc/execute/bf-11.m execution,  -O0 
FAIL: objc/execute/bf-11.m compilation,  -O1 
UNRESOLVED: objc/execute/bf-11.m execution,  -O1 
FAIL: objc/execute/bf-11.m compilation,  -O2 
UNRESOLVED: objc/execute/bf-11.m execution,  -O2 
FAIL: objc/execute/bf-11.m compilation,  -O3 -fomit-frame-pointer 
UNRESOLVED: objc/execute/bf-11.m execution,  -O3 -fomit-frame-pointer 
FAIL: objc/execute/bf-11.m compilation,  -O3 -g 
UNRESOLVED: objc/execute/bf-11.m execution,  -O3 -g 
FAIL: objc/execute/bf-11.m compilation,  -Os 
UNRESOLVED: objc/execute/bf-11.m execution,  -Os 
FAIL: objc/execute/bf-12.m compilation,  -O0 
UNRESOLVED: objc/execute/bf-12.m execution,  -O0 
FAIL: objc/execute/bf-12.m compilation,  -O1 
UNRESOLVED: objc/execute/bf-12.m execution,  -O1 
FAIL: objc/execute/bf-12.m compilation,  -O2 
UNRESOLVED: objc/execute/bf-12.m execution,  -O2 
FAIL: objc/execute/bf-12.m compilation,  -O3 -fomit-frame-pointer 
UNRESOLVED: objc/execute/bf-12.m execution,  -O3 -fomit-frame-pointer 
FAIL: objc/execute/bf-12.m compilation,  -O3 -g 
UNRESOLVED: objc/execute/bf-12.m execution,  -O3 -g 
FAIL: objc/execute/bf-12.m compilation,  -Os 
UNRESOLVED: objc/execute/bf-12.m execution,  -Os 
FAIL: objc/execute/bf-13.m compilation,  -O0 
UNRESOLVED: objc/execute/bf-13.m execution,  -O0 
FAIL: objc/execute/bf-13.m compilation,  -O1 
UNRESOLVED: objc/execute/bf-13.m execution,  -O1 
FAIL: objc/execute/bf-13.m compilation,  -O2 
UNRESOLVED: objc/execute/bf-13.m execution,  -O2 
FAIL: objc/execute/bf-13.m compilation,  -O3 -fomit-frame-pointer 
UNRESOLVED: objc/execute/bf-13.m execution,  -O3 -fomit-frame-pointer 
FAIL: objc/execute/bf-13.m compilation,  -O3 -g 
UNRESOLVED: objc/execute/bf-13.m execution,  -O3 -g 
FAIL: objc/execute/bf-13.m compilation,  -Os 
UNRESOLVED: objc/execute/bf-13.m execution,  -Os 
FAIL: objc/execute/bf-14.m compilation,  -O0 
UNRESOLVED: objc/execute/bf-14.m execution,  -O0 
FAIL: objc/execute/bf-14.m compilation,  -O1 
UNRESOLVED: objc/execute/bf-14.m execution,  -O1 
FAIL: objc/execute/bf-14.m compilation,  -O2 
UNRESOLVED: objc/execute/bf-14.m execution,  -O2 
FAIL: objc/execute/bf-14.m compilation,  -O3 -fomit-frame-pointer 
UNRESOLVED: objc/execute/bf-14.m execution,  -O3 -fomit-frame-pointer 
FAIL: objc/execute/bf-14.m compilation,  -O3 -g 
UNRESOLVED: objc/execute/bf-14.m execution,  -O3 -g 
FAIL: objc/execute/bf-14.m compilation,  -Os 
UNRESOLVED: objc/execute/bf-14.m execution,  -Os 
FAIL: objc/execute/bf-15.m compilation,  -O0 
UNRESOLVED: objc/execute/bf-15.m execution,  -O0 
FAIL: objc/execute/bf-15.m compilation,  -O1 
UNRESOLVED: objc/execute/bf-15.m execution,  -O1 
FAIL: objc/execute/bf-15.m compilation,  -O2 
UNRESOLVED: objc/execute/bf-15.m execution,  -O2 
FAIL: objc/execute/bf-15.m compilation,  -O3 -fomit-frame-pointer 
UNRESOLVED: objc/execute/bf-15.m execution,  -O3 -fomit-frame-pointer 
FAIL: objc/execute/bf-15.m compilation,  -O3 -g 
UNRESOLVED: objc/execute/bf-15.m execution,  -O3 -g 
FAIL: objc/execute/bf-15.m compilation,  -Os 
UNRESOLVED: objc/execute/bf-15.m execution,  -Os 
FAIL: objc/execute/bf-16.m compilation,  -O0 
UNRESOLVED: objc/execute/bf-16.m execution,  -O0 
FAIL: objc/execute/bf-16.m compilation,  -O1 
UNRESOLVED: objc/execute/bf-16.m execution,  -O1 
FAIL: objc/execute/bf-16.m compilation,  -O2 
UNRESOLVED: objc/execute/bf-16.m execution,  -O2 
FAIL: objc/execute/bf-16.m compilation,  -O3 -fomit-frame-pointer 
UNRESOLVED: objc/execute/bf-16.m execution,  -O3 -fomit-frame-pointer 
FAIL: objc/execute/bf-16.m compilation,  -O3 -g 
UNRESOLVED: objc/execute/bf-16.m execution,  -O3 -g 
FAIL: objc/execute/bf-16.m compilation,  -Os 
UNRESOLVED: objc/execute/bf-16.m execution,  -Os 
FAIL: objc/execute/bf-17.m compilation,  -O0 
UNRESOLVED: objc/execute/bf-17.m execution,  -O0 
FAIL: objc/execute/bf-17.m compilation,  -O1 
UNRESOLVED: objc/execute/bf-17.m execution,  -O1 
FAIL: objc/execute/bf-17.m compilation,  -O2 
UNRESOLVED: objc/execute/bf-17.m execution,  -O2 
FAIL: objc/execute/bf-17.m compilation,  -O3 -fomit-frame-pointer 
UNRESOLVED: objc/execute/bf-17.m execution,  -O3 -fomit-frame-pointer 
FAIL: objc/execute/bf-17.m compilation,  -O3 -g 
UNRESOLVED: objc/execute/bf-17.m execution,  -O3 -g 
FAIL: objc/execute/bf-17.m compilation,  -Os 
UNRESOLVED: objc/execute/bf-17.m execution,  -Os 
FAIL: objc/execute/bf-18.m compilation,  -O0 
UNRESOLVED: objc/execute/bf-18.m execution,  -O0 
FAIL: objc/execute/bf-18.m compilation,  -O1 
UNRESOLVED: objc/execute/bf-18.m execution,  -O1 
FAIL: objc/execute/bf-18.m compilation,  -O2 
UNRESOLVED: objc/execute/bf-18.m execution,  -O2 
FAIL: objc/execute/bf-18.m compilation,  -O3 -fomit-frame-pointer 
UNRESOLVED: objc/execute/bf-18.m execution,  -O3 -fomit-frame-pointer 
FAIL: objc/execute/bf-18.m compilation,  -O3 -g 
UNRESOLVED: objc/execute/bf-18.m execution,  -O3 -g 
FAIL: objc/execute/bf-18.m compilation,  -Os 
UNRESOLVED: objc/execute/bf-18.m execution,  -Os 
FAIL: objc/execute/bf-19.m compilation,  -O0 
UNRESOLVED: objc/execute/bf-19.m execution,  -O0 
FAIL: objc/execute/bf-19.m compilation,  -O1 
UNRESOLVED: objc/execute/bf-19.m execution,  -O1 
FAIL: objc/execute/bf-19.m compilation,  -O2 
UNRESOLVED: objc/execute/bf-19.m execution,  -O2 
FAIL: objc/execute/bf-19.m compilation,  -O3 -fomit-frame-pointer 
UNRESOLVED: objc/execute/bf-19.m execution,  -O3 -fomit-frame-pointer 
FAIL: objc/execute/bf-19.m compilation,  -O3 -g 
UNRESOLVED: objc/execute/bf-19.m execution,  -O3 -g 
FAIL: objc/execute/bf-19.m compilation,  -Os 
UNRESOLVED: objc/execute/bf-19.m execution,  -Os 
FAIL: objc/execute/bf-2.m compilation,  -O0 
UNRESOLVED: objc/execute/bf-2.m execution,  -O0 
FAIL: objc/execute/bf-2.m compilation,  -O1 
UNRESOLVED: objc/execute/bf-2.m execution,  -O1 
FAIL: objc/execute/bf-2.m compilation,  -O2 
UNRESOLVED: objc/execute/bf-2.m execution,  -O2 
FAIL: objc/execute/bf-2.m compilation,  -O3 -fomit-frame-pointer 
UNRESOLVED: objc/execute/bf-2.m execution,  -O3 -fomit-frame-pointer 
FAIL: objc/execute/bf-2.m compilation,  -O3 -g 
UNRESOLVED: objc/execute/bf-2.m execution,  -O3 -g 
FAIL: objc/execute/bf-2.m compilation,  -Os 
UNRESOLVED: objc/execute/bf-2.m execution,  -Os 
FAIL: objc/execute/bf-20.m compilation,  -O0 
UNRESOLVED: objc/execute/bf-20.m execution,  -O0 
FAIL: objc/execute/bf-20.m compilation,  -O1 
UNRESOLVED: objc/execute/bf-20.m execution,  -O1 
FAIL: objc/execute/bf-20.m compilation,  -O2 
UNRESOLVED: objc/execute/bf-20.m execution,  -O2 
FAIL: objc/execute/bf-20.m compilation,  -O3 -fomit-frame-pointer 
UNRESOLVED: objc/execute/bf-20.m execution,  -O3 -fomit-frame-pointer 
FAIL: objc/execute/bf-20.m compilation,  -O3 -g 
UNRESOLVED: objc/execute/bf-20.m execution,  -O3 -g 
FAIL: objc/execute/bf-20.m compilation,  -Os 
UNRESOLVED: objc/execute/bf-20.m execution,  -Os 
FAIL: objc/execute/bf-21.m compilation,  -O0 
UNRESOLVED: objc/execute/bf-21.m execution,  -O0 
FAIL: objc/execute/bf-21.m compilation,  -O1 
UNRESOLVED: objc/execute/bf-21.m execution,  -O1 
FAIL: objc/execute/bf-21.m compilation,  -O2 
UNRESOLVED: objc/execute/bf-21.m execution,  -O2 
FAIL: objc/execute/bf-21.m compilation,  -O3 -fomit-frame-pointer 
UNRESOLVED: objc/execute/bf-21.m execution,  -O3 -fomit-frame-pointer 
FAIL: objc/execute/bf-21.m compilation,  -O3 -g 
UNRESOLVED: objc/execute/bf-21.m execution,  -O3 -g 
FAIL: objc/execute/bf-21.m compilation,  -Os 
UNRESOLVED: objc/execute/bf-21.m execution,  -Os 
FAIL: objc/execute/bf-3.m compilation,  -O0 
UNRESOLVED: objc/execute/bf-3.m execution,  -O0 
FAIL: objc/execute/bf-3.m compilation,  -O1 
UNRESOLVED: objc/execute/bf-3.m execution,  -O1 
FAIL: objc/execute/bf-3.m compilation,  -O2 
UNRESOLVED: objc/execute/bf-3.m execution,  -O2 
FAIL: objc/execute/bf-3.m compilation,  -O3 -fomit-frame-pointer 
UNRESOLVED: objc/execute/bf-3.m execution,  -O3 -fomit-frame-pointer 
FAIL: objc/execute/bf-3.m compilation,  -O3 -g 
UNRESOLVED: objc/execute/bf-3.m execution,  -O3 -g 
FAIL: objc/execute/bf-3.m compilation,  -Os 
UNRESOLVED: objc/execute/bf-3.m execution,  -Os 
FAIL: objc/execute/bf-4.m compilation,  -O0 
UNRESOLVED: objc/execute/bf-4.m execution,  -O0 
FAIL: objc/execute/bf-4.m compilation,  -O1 
UNRESOLVED: objc/execute/bf-4.m execution,  -O1 
FAIL: objc/execute/bf-4.m compilation,  -O2 
UNRESOLVED: objc/execute/bf-4.m execution,  -O2 
FAIL: objc/execute/bf-4.m compilation,  -O3 -fomit-frame-pointer 
UNRESOLVED: objc/execute/bf-4.m execution,  -O3 -fomit-frame-pointer 
FAIL: objc/execute/bf-4.m compilation,  -O3 -g 
UNRESOLVED: objc/execute/bf-4.m execution,  -O3 -g 
FAIL: objc/execute/bf-4.m compilation,  -Os 
UNRESOLVED: objc/execute/bf-4.m execution,  -Os 
FAIL: objc/execute/bf-5.m compilation,  -O0 
UNRESOLVED: objc/execute/bf-5.m execution,  -O0 
FAIL: objc/execute/bf-5.m compilation,  -O1 
UNRESOLVED: objc/execute/bf-5.m execution,  -O1 
FAIL: objc/execute/bf-5.m compilation,  -O2 
UNRESOLVED: objc/execute/bf-5.m execution,  -O2 
FAIL: objc/execute/bf-5.m compilation,  -O3 -fomit-frame-pointer 
UNRESOLVED: objc/execute/bf-5.m execution,  -O3 -fomit-frame-pointer 
FAIL: objc/execute/bf-5.m compilation,  -O3 -g 
UNRESOLVED: objc/execute/bf-5.m execution,  -O3 -g 
FAIL: objc/execute/bf-5.m compilation,  -Os 
UNRESOLVED: objc/execute/bf-5.m execution,  -Os 
FAIL: objc/execute/bf-6.m compilation,  -O0 
UNRESOLVED: objc/execute/bf-6.m execution,  -O0 
FAIL: objc/execute/bf-6.m compilation,  -O1 
UNRESOLVED: objc/execute/bf-6.m execution,  -O1 
FAIL: objc/execute/bf-6.m compilation,  -O2 
UNRESOLVED: objc/execute/bf-6.m execution,  -O2 
FAIL: objc/execute/bf-6.m compilation,  -O3 -fomit-frame-pointer 
UNRESOLVED: objc/execute/bf-6.m execution,  -O3 -fomit-frame-pointer 
FAIL: objc/execute/bf-6.m compilation,  -O3 -g 
UNRESOLVED: objc/execute/bf-6.m execution,  -O3 -g 
FAIL: objc/execute/bf-6.m compilation,  -Os 
UNRESOLVED: objc/execute/bf-6.m execution,  -Os 
FAIL: objc/execute/bf-7.m compilation,  -O0 
UNRESOLVED: objc/execute/bf-7.m execution,  -O0 
FAIL: objc/execute/bf-7.m compilation,  -O1 
UNRESOLVED: objc/execute/bf-7.m execution,  -O1 
FAIL: objc/execute/bf-7.m compilation,  -O2 
UNRESOLVED: objc/execute/bf-7.m execution,  -O2 
FAIL: objc/execute/bf-7.m compilation,  -O3 -fomit-frame-pointer 
UNRESOLVED: objc/execute/bf-7.m execution,  -O3 -fomit-frame-pointer 
FAIL: objc/execute/bf-7.m compilation,  -O3 -g 
UNRESOLVED: objc/execute/bf-7.m execution,  -O3 -g 
FAIL: objc/execute/bf-7.m compilation,  -Os 
UNRESOLVED: objc/execute/bf-7.m execution,  -Os 
FAIL: objc/execute/bf-8.m compilation,  -O0 
UNRESOLVED: objc/execute/bf-8.m execution,  -O0 
FAIL: objc/execute/bf-8.m compilation,  -O1 
UNRESOLVED: objc/execute/bf-8.m execution,  -O1 
FAIL: objc/execute/bf-8.m compilation,  -O2 
UNRESOLVED: objc/execute/bf-8.m execution,  -O2 
FAIL: objc/execute/bf-8.m compilation,  -O3 -fomit-frame-pointer 
UNRESOLVED: objc/execute/bf-8.m execution,  -O3 -fomit-frame-pointer 
FAIL: objc/execute/bf-8.m compilation,  -O3 -g 
UNRESOLVED: objc/execute/bf-8.m execution,  -O3 -g 
FAIL: objc/execute/bf-8.m compilation,  -Os 
UNRESOLVED: objc/execute/bf-8.m execution,  -Os 
FAIL: objc/execute/bf-9.m compilation,  -O0 
UNRESOLVED: objc/execute/bf-9.m execution,  -O0 
FAIL: objc/execute/bf-9.m compilation,  -O1 
UNRESOLVED: objc/execute/bf-9.m execution,  -O1 
FAIL: objc/execute/bf-9.m compilation,  -O2 
UNRESOLVED: objc/execute/bf-9.m execution,  -O2 
FAIL: objc/execute/bf-9.m compilation,  -O3 -fomit-frame-pointer 
UNRESOLVED: objc/execute/bf-9.m execution,  -O3 -fomit-frame-pointer 
FAIL: objc/execute/bf-9.m compilation,  -O3 -g 
UNRESOLVED: objc/execute/bf-9.m execution,  -O3 -g 
FAIL: objc/execute/bf-9.m compilation,  -Os 
UNRESOLVED: objc/execute/bf-9.m execution,  -Os 
FAIL: objc/execute/bycopy-3.m compilation,  -O0 
UNRESOLVED: objc/execute/bycopy-3.m execution,  -O0 
FAIL: objc/execute/bycopy-3.m compilation,  -O1 
UNRESOLVED: objc/execute/bycopy-3.m execution,  -O1 
FAIL: objc/execute/bycopy-3.m compilation,  -O2 
UNRESOLVED: objc/execute/bycopy-3.m execution,  -O2 
FAIL: objc/execute/bycopy-3.m compilation,  -O3 -fomit-frame-pointer 
UNRESOLVED: objc/execute/bycopy-3.m execution,  -O3 -fomit-frame-pointer 
FAIL: objc/execute/bycopy-3.m compilation,  -O3 -g 
UNRESOLVED: objc/execute/bycopy-3.m execution,  -O3 -g 
FAIL: objc/execute/bycopy-3.m compilation,  -Os 
UNRESOLVED: objc/execute/bycopy-3.m execution,  -Os 
FAIL: objc/execute/class-1.m compilation,  -O0 
UNRESOLVED: objc/execute/class-1.m execution,  -O0 
FAIL: objc/execute/class-1.m compilation,  -O1 
UNRESOLVED: objc/execute/class-1.m execution,  -O1 
FAIL: objc/execute/class-1.m compilation,  -O2 
UNRESOLVED: objc/execute/class-1.m execution,  -O2 
FAIL: objc/execute/class-1.m compilation,  -O3 -fomit-frame-pointer 
UNRESOLVED: objc/execute/class-1.m execution,  -O3 -fomit-frame-pointer 
FAIL: objc/execute/class-1.m compilation,  -O3 -g 
UNRESOLVED: objc/execute/class-1.m execution,  -O3 -g 
FAIL: objc/execute/class-1.m compilation,  -Os 
UNRESOLVED: objc/execute/class-1.m execution,  -Os 
FAIL: objc/execute/class-10.m compilation,  -O0 
UNRESOLVED: objc/execute/class-10.m execution,  -O0 
FAIL: objc/execute/class-10.m compilation,  -O1 
UNRESOLVED: objc/execute/class-10.m execution,  -O1 
FAIL: objc/execute/class-10.m compilation,  -O2 
UNRESOLVED: objc/execute/class-10.m execution,  -O2 
FAIL: objc/execute/class-10.m compilation,  -O3 -fomit-frame-pointer 
UNRESOLVED: objc/execute/class-10.m execution,  -O3 -fomit-frame-pointer 
FAIL: objc/execute/class-10.m compilation,  -O3 -g 
UNRESOLVED: objc/execute/class-10.m execution,  -O3 -g 
FAIL: objc/execute/class-10.m compilation,  -Os 
UNRESOLVED: objc/execute/class-10.m execution,  -Os 
FAIL: objc/execute/class-11.m compilation,  -O0 
UNRESOLVED: objc/execute/class-11.m execution,  -O0 
FAIL: objc/execute/class-11.m compilation,  -O1 
UNRESOLVED: objc/execute/class-11.m execution,  -O1 
FAIL: objc/execute/class-11.m compilation,  -O2 
UNRESOLVED: objc/execute/class-11.m execution,  -O2 
FAIL: objc/execute/class-11.m compilation,  -O3 -fomit-frame-pointer 
UNRESOLVED: objc/execute/class-11.m execution,  -O3 -fomit-frame-pointer 
FAIL: objc/execute/class-11.m compilation,  -O3 -g 
UNRESOLVED: objc/execute/class-11.m execution,  -O3 -g 
FAIL: objc/execute/class-11.m compilation,  -Os 
UNRESOLVED: objc/execute/class-11.m execution,  -Os 
FAIL: objc/execute/class-12.m compilation,  -O0 
UNRESOLVED: objc/execute/class-12.m execution,  -O0 
FAIL: objc/execute/class-12.m compilation,  -O1 
UNRESOLVED: objc/execute/class-12.m execution,  -O1 
FAIL: objc/execute/class-12.m compilation,  -O2 
UNRESOLVED: objc/execute/class-12.m execution,  -O2 
FAIL: objc/execute/class-12.m compilation,  -O3 -fomit-frame-pointer 
UNRESOLVED: objc/execute/class-12.m execution,  -O3 -fomit-frame-pointer 
FAIL: objc/execute/class-12.m compilation,  -O3 -g 
UNRESOLVED: objc/execute/class-12.m execution,  -O3 -g 
FAIL: objc/execute/class-12.m compilation,  -Os 
UNRESOLVED: objc/execute/class-12.m execution,  -Os 
FAIL: objc/execute/class-13.m compilation,  -O0 
UNRESOLVED: objc/execute/class-13.m execution,  -O0 
FAIL: objc/execute/class-13.m compilation,  -O1 
UNRESOLVED: objc/execute/class-13.m execution,  -O1 
FAIL: objc/execute/class-13.m compilation,  -O2 
UNRESOLVED: objc/execute/class-13.m execution,  -O2 
FAIL: objc/execute/class-13.m compilation,  -O3 -fomit-frame-pointer 
UNRESOLVED: objc/execute/class-13.m execution,  -O3 -fomit-frame-pointer 
FAIL: objc/execute/class-13.m compilation,  -O3 -g 
UNRESOLVED: objc/execute/class-13.m execution,  -O3 -g 
FAIL: objc/execute/class-13.m compilation,  -Os 
UNRESOLVED: objc/execute/class-13.m execution,  -Os 
FAIL: objc/execute/class-14.m compilation,  -O0 
UNRESOLVED: objc/execute/class-14.m execution,  -O0 
FAIL: objc/execute/class-14.m compilation,  -O1 
UNRESOLVED: objc/execute/class-14.m execution,  -O1 
FAIL: objc/execute/class-14.m compilation,  -O2 
UNRESOLVED: objc/execute/class-14.m execution,  -O2 
FAIL: objc/execute/class-14.m compilation,  -O3 -fomit-frame-pointer 
UNRESOLVED: objc/execute/class-14.m execution,  -O3 -fomit-frame-pointer 
FAIL: objc/execute/class-14.m compilation,  -O3 -g 
UNRESOLVED: objc/execute/class-14.m execution,  -O3 -g 
FAIL: objc/execute/class-14.m compilation,  -Os 
UNRESOLVED: objc/execute/class-14.m execution,  -Os 
FAIL: objc/execute/class-2.m compilation,  -O0 
UNRESOLVED: objc/execute/class-2.m execution,  -O0 
FAIL: objc/execute/class-2.m compilation,  -O1 
UNRESOLVED: objc/execute/class-2.m execution,  -O1 
FAIL: objc/execute/class-2.m compilation,  -O2 
UNRESOLVED: objc/execute/class-2.m execution,  -O2 
FAIL: objc/execute/class-2.m compilation,  -O3 -fomit-frame-pointer 
UNRESOLVED: objc/execute/class-2.m execution,  -O3 -fomit-frame-pointer 
FAIL: objc/execute/class-2.m compilation,  -O3 -g 
UNRESOLVED: objc/execute/class-2.m execution,  -O3 -g 
FAIL: objc/execute/class-2.m compilation,  -Os 
UNRESOLVED: objc/execute/class-2.m execution,  -Os 
FAIL: objc/execute/class-3.m compilation,  -O0 
UNRESOLVED: objc/execute/class-3.m execution,  -O0 
FAIL: objc/execute/class-3.m compilation,  -O1 
UNRESOLVED: objc/execute/class-3.m execution,  -O1 
FAIL: objc/execute/class-3.m compilation,  -O2 
UNRESOLVED: objc/execute/class-3.m execution,  -O2 
FAIL: objc/execute/class-3.m compilation,  -O3 -fomit-frame-pointer 
UNRESOLVED: objc/execute/class-3.m execution,  -O3 -fomit-frame-pointer 
FAIL: objc/execute/class-3.m compilation,  -O3 -g 
UNRESOLVED: objc/execute/class-3.m execution,  -O3 -g 
FAIL: objc/execute/class-3.m compilation,  -Os 
UNRESOLVED: objc/execute/class-3.m execution,  -Os 
FAIL: objc/execute/class-4.m compilation,  -O0 
UNRESOLVED: objc/execute/class-4.m execution,  -O0 
FAIL: objc/execute/class-4.m compilation,  -O1 
UNRESOLVED: objc/execute/class-4.m execution,  -O1 
FAIL: objc/execute/class-4.m compilation,  -O2 
UNRESOLVED: objc/execute/class-4.m execution,  -O2 
FAIL: objc/execute/class-4.m compilation,  -O3 -fomit-frame-pointer 
UNRESOLVED: objc/execute/class-4.m execution,  -O3 -fomit-frame-pointer 
FAIL: objc/execute/class-4.m compilation,  -O3 -g 
UNRESOLVED: objc/execute/class-4.m execution,  -O3 -g 
FAIL: objc/execute/class-4.m compilation,  -Os 
UNRESOLVED: objc/execute/class-4.m execution,  -Os 
FAIL: objc/execute/class-5.m compilation,  -O0 
UNRESOLVED: objc/execute/class-5.m execution,  -O0 
FAIL: objc/execute/class-5.m compilation,  -O1 
UNRESOLVED: objc/execute/class-5.m execution,  -O1 
FAIL: objc/execute/class-5.m compilation,  -O2 
UNRESOLVED: objc/execute/class-5.m execution,  -O2 
FAIL: objc/execute/class-5.m compilation,  -O3 -fomit-frame-pointer 
UNRESOLVED: objc/execute/class-5.m execution,  -O3 -fomit-frame-pointer 
FAIL: objc/execute/class-5.m compilation,  -O3 -g 
UNRESOLVED: objc/execute/class-5.m execution,  -O3 -g 
FAIL: objc/execute/class-5.m compilation,  -Os 
UNRESOLVED: objc/execute/class-5.m execution,  -Os 
FAIL: objc/execute/class-6.m compilation,  -O0 
UNRESOLVED: objc/execute/class-6.m execution,  -O0 
FAIL: objc/execute/class-6.m compilation,  -O1 
UNRESOLVED: objc/execute/class-6.m execution,  -O1 
FAIL: objc/execute/class-6.m compilation,  -O2 
UNRESOLVED: objc/execute/class-6.m execution,  -O2 
FAIL: objc/execute/class-6.m compilation,  -O3 -fomit-frame-pointer 
UNRESOLVED: objc/execute/class-6.m execution,  -O3 -fomit-frame-pointer 
FAIL: objc/execute/class-6.m compilation,  -O3 -g 
UNRESOLVED: objc/execute/class-6.m execution,  -O3 -g 
FAIL: objc/execute/class-6.m compilation,  -Os 
UNRESOLVED: objc/execute/class-6.m execution,  -Os 
FAIL: objc/execute/class-7.m compilation,  -O0 
UNRESOLVED: objc/execute/class-7.m execution,  -O0 
FAIL: objc/execute/class-7.m compilation,  -O1 
UNRESOLVED: objc/execute/class-7.m execution,  -O1 
FAIL: objc/execute/class-7.m compilation,  -O2 
UNRESOLVED: objc/execute/class-7.m execution,  -O2 
FAIL: objc/execute/class-7.m compilation,  -O3 -fomit-frame-pointer 
UNRESOLVED: objc/execute/class-7.m execution,  -O3 -fomit-frame-pointer 
FAIL: objc/execute/class-7.m compilation,  -O3 -g 
UNRESOLVED: objc/execute/class-7.m execution,  -O3 -g 
FAIL: objc/execute/class-7.m compilation,  -Os 
UNRESOLVED: objc/execute/class-7.m execution,  -Os 
FAIL: objc/execute/class-8.m compilation,  -O0 
UNRESOLVED: objc/execute/class-8.m execution,  -O0 
FAIL: objc/execute/class-8.m compilation,  -O1 
UNRESOLVED: objc/execute/class-8.m execution,  -O1 
FAIL: objc/execute/class-8.m compilation,  -O2 
UNRESOLVED: objc/execute/class-8.m execution,  -O2 
FAIL: objc/execute/class-8.m compilation,  -O3 -fomit-frame-pointer 
UNRESOLVED: objc/execute/class-8.m execution,  -O3 -fomit-frame-pointer 
FAIL: objc/execute/class-8.m compilation,  -O3 -g 
UNRESOLVED: objc/execute/class-8.m execution,  -O3 -g 
FAIL: objc/execute/class-8.m compilation,  -Os 
UNRESOLVED: objc/execute/class-8.m execution,  -Os 
FAIL: objc/execute/class-9.m compilation,  -O0 
UNRESOLVED: objc/execute/class-9.m execution,  -O0 
FAIL: objc/execute/class-9.m compilation,  -O1 
UNRESOLVED: objc/execute/class-9.m execution,  -O1 
FAIL: objc/execute/class-9.m compilation,  -O2 
UNRESOLVED: objc/execute/class-9.m execution,  -O2 
FAIL: objc/execute/class-9.m compilation,  -O3 -fomit-frame-pointer 
UNRESOLVED: objc/execute/class-9.m execution,  -O3 -fomit-frame-pointer 
FAIL: objc/execute/class-9.m compilation,  -O3 -g 
UNRESOLVED: objc/execute/class-9.m execution,  -O3 -g 
FAIL: objc/execute/class-9.m compilation,  -Os 
UNRESOLVED: objc/execute/class-9.m execution,  -Os 
FAIL: objc/execute/class_self-1.m execution,  -O0 
FAIL: objc/execute/class_self-1.m execution,  -O1 
FAIL: objc/execute/class_self-1.m execution,  -O2 
FAIL: objc/execute/class_self-1.m execution,  -O3 -fomit-frame-pointer 
FAIL: objc/execute/class_self-1.m execution,  -O3 -g 
FAIL: objc/execute/class_self-1.m execution,  -Os 
FAIL: objc/execute/class_self-2.m execution,  -O0 
FAIL: objc/execute/class_self-2.m execution,  -O1 
FAIL: objc/execute/class_self-2.m execution,  -O2 
FAIL: objc/execute/class_self-2.m execution,  -O3 -fomit-frame-pointer 
FAIL: objc/execute/class_self-2.m execution,  -O3 -g 
FAIL: objc/execute/class_self-2.m execution,  -Os 
FAIL: objc/execute/many_args_method.m execution,  -O0 
FAIL: objc/execute/many_args_method.m execution,  -O1 
FAIL: objc/execute/many_args_method.m execution,  -O2 
FAIL: objc/execute/many_args_method.m execution,  -O3 -fomit-frame-pointer 
FAIL: objc/execute/many_args_method.m execution,  -O3 -g 
FAIL: objc/execute/many_args_method.m execution,  -Os 
FAIL: objc/execute/nested-3.m execution,  -O0 
FAIL: objc/execute/nested-3.m execution,  -O1 
FAIL: objc/execute/nested-3.m execution,  -O2 
FAIL: objc/execute/nested-3.m execution,  -O3 -fomit-frame-pointer 
FAIL: objc/execute/nested-3.m execution,  -O3 -g 
FAIL: objc/execute/nested-3.m execution,  -Os 
FAIL: objc/execute/np-2.m execution,  -O0 
FAIL: objc/execute/np-2.m execution,  -O1 
FAIL: objc/execute/np-2.m execution,  -O2 
FAIL: objc/execute/np-2.m execution,  -O3 -fomit-frame-pointer 
FAIL: objc/execute/np-2.m execution,  -O3 -g 
FAIL: objc/execute/np-2.m execution,  -Os 
FAIL: objc/execute/redefining_self.m execution,  -O0 
FAIL: objc/execute/redefining_self.m execution,  -O1 
FAIL: objc/execute/redefining_self.m execution,  -O2 
FAIL: objc/execute/redefining_self.m execution,  -O3 -fomit-frame-pointer 
FAIL: objc/execute/redefining_self.m execution,  -O3 -g 
FAIL: objc/execute/redefining_self.m execution,  -Os 
FAIL: objc/execute/root_methods.m compilation,  -O0 
UNRESOLVED: objc/execute/root_methods.m execution,  -O0 
FAIL: objc/execute/root_methods.m compilation,  -O1 
UNRESOLVED: objc/execute/root_methods.m execution,  -O1 
FAIL: objc/execute/root_methods.m compilation,  -O2 
UNRESOLVED: objc/execute/root_methods.m execution,  -O2 
FAIL: objc/execute/root_methods.m compilation,  -O3 -fomit-frame-pointer 
UNRESOLVED: objc/execute/root_methods.m execution,  -O3 -fomit-frame-pointer 
FAIL: objc/execute/root_methods.m compilation,  -O3 -g 
UNRESOLVED: objc/execute/root_methods.m execution,  -O3 -g 
FAIL: objc/execute/root_methods.m compilation,  -Os 
UNRESOLVED: objc/execute/root_methods.m execution,  -Os 
FAIL: objc/execute/static-1.m execution,  -O0 
FAIL: objc/execute/static-1.m execution,  -O1 
FAIL: objc/execute/static-1.m execution,  -O2 
FAIL: objc/execute/static-1.m execution,  -O3 -fomit-frame-pointer 
FAIL: objc/execute/static-1.m execution,  -O3 -g 
FAIL: objc/execute/static-1.m execution,  -Os 
FAIL: objc/execute/static-2.m execution,  -O0 
FAIL: objc/execute/static-2.m execution,  -O1 
FAIL: objc/execute/static-2.m execution,  -O2 
FAIL: objc/execute/static-2.m execution,  -O3 -fomit-frame-pointer 
FAIL: objc/execute/static-2.m execution,  -O3 -g 
FAIL: objc/execute/static-2.m execution,  -Os 
FAIL: objc/execute/string1.m compilation,  -O0 
UNRESOLVED: objc/execute/string1.m execution,  -O0 
FAIL: objc/execute/string1.m compilation,  -O1 
UNRESOLVED: objc/execute/string1.m execution,  -O1 
FAIL: objc/execute/string1.m compilation,  -O2 
UNRESOLVED: objc/execute/string1.m execution,  -O2 
FAIL: objc/execute/string1.m compilation,  -O3 -fomit-frame-pointer 
UNRESOLVED: objc/execute/string1.m execution,  -O3 -fomit-frame-pointer 
FAIL: objc/execute/string1.m compilation,  -O3 -g 
UNRESOLVED: objc/execute/string1.m execution,  -O3 -g 
FAIL: objc/execute/string1.m compilation,  -Os 
UNRESOLVED: objc/execute/string1.m execution,  -Os 
FAIL: objc/execute/string2.m compilation,  -O0 
UNRESOLVED: objc/execute/string2.m execution,  -O0 
FAIL: objc/execute/string2.m compilation,  -O1 
UNRESOLVED: objc/execute/string2.m execution,  -O1 
FAIL: objc/execute/string2.m compilation,  -O2 
UNRESOLVED: objc/execute/string2.m execution,  -O2 
FAIL: objc/execute/string2.m compilation,  -O3 -fomit-frame-pointer 
UNRESOLVED: objc/execute/string2.m execution,  -O3 -fomit-frame-pointer 
FAIL: objc/execute/string2.m compilation,  -O3 -g 
UNRESOLVED: objc/execute/string2.m execution,  -O3 -g 
FAIL: objc/execute/string2.m compilation,  -Os 
UNRESOLVED: objc/execute/string2.m execution,  -Os 
FAIL: objc/execute/string3.m compilation,  -O0 
UNRESOLVED: objc/execute/string3.m execution,  -O0 
FAIL: objc/execute/string3.m compilation,  -O1 
UNRESOLVED: objc/execute/string3.m execution,  -O1 
FAIL: objc/execute/string3.m compilation,  -O2 
UNRESOLVED: objc/execute/string3.m execution,  -O2 
FAIL: objc/execute/string3.m compilation,  -O3 -fomit-frame-pointer 
UNRESOLVED: objc/execute/string3.m execution,  -O3 -fomit-frame-pointer 
FAIL: objc/execute/string3.m compilation,  -O3 -g 
UNRESOLVED: objc/execute/string3.m execution,  -O3 -g 
FAIL: objc/execute/string3.m compilation,  -Os 
UNRESOLVED: objc/execute/string3.m execution,  -Os 
FAIL: objc/execute/string4.m compilation,  -O0 
UNRESOLVED: objc/execute/string4.m execution,  -O0 
FAIL: objc/execute/string4.m compilation,  -O1 
UNRESOLVED: objc/execute/string4.m execution,  -O1 
FAIL: objc/execute/string4.m compilation,  -O2 
UNRESOLVED: objc/execute/string4.m execution,  -O2 
FAIL: objc/execute/string4.m compilation,  -O3 -fomit-frame-pointer 
UNRESOLVED: objc/execute/string4.m execution,  -O3 -fomit-frame-pointer 
FAIL: objc/execute/string4.m compilation,  -O3 -g 
UNRESOLVED: objc/execute/string4.m execution,  -O3 -g 
FAIL: objc/execute/string4.m compilation,  -Os 
UNRESOLVED: objc/execute/string4.m execution,  -Os 
FAIL: objc/execute/va_method.m execution,  -O0 
FAIL: objc/execute/va_method.m execution,  -O1 
FAIL: objc/execute/va_method.m execution,  -O2 
FAIL: objc/execute/va_method.m execution,  -O3 -fomit-frame-pointer 
FAIL: objc/execute/va_method.m execution,  -O3 -fomit-frame-pointer -funroll-loops 
FAIL: objc/execute/va_method.m execution,  -O3 -fomit-frame-pointer -funroll-all-loops
-finline-functions 
FAIL: objc/execute/va_method.m execution,  -O3 -g 
FAIL: objc/execute/va_method.m execution,  -Os 
FAIL: objc.dg/special/unclaimed-category-1.m (test for excess errors)
WARNING: objc.dg/special/unclaimed-category-1.m compilation failed to produce executable

		=== objc Summary ===

# of expected passes		582
# of unexpected failures	315
# of unresolved testcases	258
/Users/regress/tbox/native/build/gcc/xgcc version 3.4 20030630 (experimental)

		=== libstdc++-v3 tests ===

Running target unix
FAIL: 26_numerics/c99_classification_macros_c++.cc (test for excess errors)
FAIL: 26_numerics/c99_classification_macros_c.cc (test for excess errors)
FAIL: 27_io/basic_filebuf/open/char/9507.cc execution test

		=== libstdc++-v3 Summary ===

# of expected passes		1498
# of unexpected failures	3

Compiler version: 3.4 20030630 (experimental) 
Platform: powerpc-apple-darwin6.3
configure flags: --prefix=/Users/regress/tbox/objs --target=powerpc-apple-darwin6.3

H.J. Lu | 1 Jul 02:22 2003
Picon

Results for 3.3 20030623 (Red Hat Linux 3.3-12) testsuite on ia64-unknown-linux-gnu

LAST_UPDATED: Mon Jun 30 16:01:31 UTC 2003

Native configuration is ia64-unknown-linux-gnu

		=== g77 tests ===

Running target unix

		=== g77 Summary ===

# of expected passes		1686
# of unsupported tests		8
/export/build/gnu/gcc-3.3-redhat/build-ia64-linux/gcc/testsuite/../g77 version 3.3 20030623
(Red Hat Linux 3.3-12)

		=== gcc tests ===

Running target unix
FAIL: gcc.c-torture/compile/930117-1.c,  -O1  
FAIL: gcc.c-torture/compile/930117-1.c,  -O2  
FAIL: gcc.c-torture/compile/930117-1.c,  -O3 -fomit-frame-pointer  
FAIL: gcc.c-torture/compile/930117-1.c,  -O3 -g  
FAIL: gcc.c-torture/compile/930117-1.c,  -Os  
XPASS: gcc.c-torture/compile/981223-1.c,  -O2  
XPASS: gcc.c-torture/compile/981223-1.c,  -O3 -fomit-frame-pointer  
XPASS: gcc.c-torture/compile/981223-1.c,  -O3 -g  
XPASS: gcc.c-torture/compile/981223-1.c,  -Os  
FAIL: gcc.c-torture/compile/iftrap-1.c,  -O1  
FAIL: gcc.c-torture/compile/iftrap-1.c,  -O2  
FAIL: gcc.c-torture/compile/iftrap-1.c,  -O3 -fomit-frame-pointer  
FAIL: gcc.c-torture/compile/iftrap-1.c,  -O3 -fomit-frame-pointer -funroll-loops  
FAIL: gcc.c-torture/compile/iftrap-1.c,  -O3 -fomit-frame-pointer -funroll-all-loops
-finline-functions  
FAIL: gcc.c-torture/compile/iftrap-1.c,  -O3 -g  
FAIL: gcc.c-torture/compile/iftrap-1.c,  -Os  
FAIL: gcc.c-torture/compile/iftrap-2.c,  -O1  
FAIL: gcc.c-torture/compile/iftrap-2.c,  -O2  
FAIL: gcc.c-torture/compile/iftrap-2.c,  -O3 -fomit-frame-pointer  
FAIL: gcc.c-torture/compile/iftrap-2.c,  -O3 -g  
FAIL: gcc.c-torture/compile/iftrap-2.c,  -Os  
XPASS: gcc.c-torture/execute/20020227-1.c execution,  -O0 
FAIL: gcc.c-torture/execute/20020227-1.c compilation,  -O2 
UNRESOLVED: gcc.c-torture/execute/20020227-1.c execution,  -O2 
FAIL: gcc.c-torture/execute/20020227-1.c compilation,  -O3 -fomit-frame-pointer 
UNRESOLVED: gcc.c-torture/execute/20020227-1.c execution,  -O3 -fomit-frame-pointer 
FAIL: gcc.c-torture/execute/20020227-1.c compilation,  -O3 -g 
UNRESOLVED: gcc.c-torture/execute/20020227-1.c execution,  -O3 -g 
FAIL: gcc.c-torture/execute/20020227-1.c compilation,  -Os 
UNRESOLVED: gcc.c-torture/execute/20020227-1.c execution,  -Os 
FAIL: gcc.c-torture/execute/20020418-1.c compilation,  -O1 
UNRESOLVED: gcc.c-torture/execute/20020418-1.c execution,  -O1 
FAIL: gcc.c-torture/execute/20020418-1.c compilation,  -O2 
UNRESOLVED: gcc.c-torture/execute/20020418-1.c execution,  -O2 
FAIL: gcc.c-torture/execute/20020418-1.c compilation,  -O3 -fomit-frame-pointer 
UNRESOLVED: gcc.c-torture/execute/20020418-1.c execution,  -O3 -fomit-frame-pointer 
FAIL: gcc.c-torture/execute/20020418-1.c compilation,  -O3 -g 
UNRESOLVED: gcc.c-torture/execute/20020418-1.c execution,  -O3 -g 
FAIL: gcc.c-torture/execute/20020418-1.c compilation,  -Os 
UNRESOLVED: gcc.c-torture/execute/20020418-1.c execution,  -Os 
FAIL: gcc.c-torture/execute/string-opt-17.c execution,  -O1 
FAIL: gcc.c-torture/execute/string-opt-17.c execution,  -O2 
FAIL: gcc.c-torture/execute/string-opt-17.c execution,  -O3 -fomit-frame-pointer 
FAIL: gcc.c-torture/execute/string-opt-17.c execution,  -O3 -g 
FAIL: gcc.c-torture/execute/string-opt-17.c execution,  -Os 
FAIL: gcc.dg/20030225-2.c execution test
FAIL: gcc.dg/duff-2.c (test for excess errors)
FAIL: gcc.dg/iftrap-1.c (test for excess errors)
ERROR: gcc.dg/iftrap-1.c: error executing dg-final: couldn't open "iftrap-1.s": no such file or directory
UNRESOLVED: gcc.dg/iftrap-1.c: error executing dg-final: couldn't open "iftrap-1.s": no such file or directory
FAIL: gcc.dg/iftrap-2.c (test for excess errors)
ERROR: gcc.dg/iftrap-2.c: error executing dg-final: couldn't open "iftrap-2.s": no such file or directory
UNRESOLVED: gcc.dg/iftrap-2.c: error executing dg-final: couldn't open "iftrap-2.s": no such file or directory

		=== gcc Summary ===

# of expected passes		20610
# of unexpected failures	35
# of unexpected successes	5
# of expected failures		78
# of unresolved testcases	11
# of unsupported tests		166
/export/build/gnu/gcc-3.3-redhat/build-ia64-linux/gcc/xgcc version 3.3 20030623 (Red Hat Linux 3.3-12)

		=== g++ tests ===

Running target unix
FAIL: g++.dg/tls/init-2.C (test for excess errors)

		=== g++ Summary ===

# of expected passes		7770
# of unexpected failures	1
# of expected failures		97
# of untested testcases		23
# of unsupported tests		18
/export/build/gnu/gcc-3.3-redhat/build-ia64-linux/gcc/testsuite/../g++ version 3.3 20030623
(Red Hat Linux 3.3-12)

		=== objc tests ===

Running target unix

		=== objc Summary ===

# of expected passes		1153
/export/build/gnu/gcc-3.3-redhat/build-ia64-linux/gcc/xgcc version 3.3 20030623 (Red Hat Linux 3.3-12)

		=== libjava tests ===

Running target unix
WARNING: program timed out.
FAIL: SyncTest execution - gij test
FAIL: Thread_Interrupt output - gij test

		=== libjava Summary ===

# of expected passes		2988
# of unexpected failures	2
# of expected failures		16
# of untested testcases		13
		=== libstdc++-v3 tests ===

Running target unix
XPASS: 22_locale/ctype_is_char.cc execution test
XPASS: 22_locale/ctype_is_wchar_t.cc execution test
XPASS: 22_locale/members.cc execution test
XPASS: 22_locale/messages_byname.cc execution test
XPASS: 22_locale/messages_members_char.cc execution test
XPASS: 22_locale/money_get_members_char.cc execution test
XPASS: 22_locale/money_get_members_wchar_t.cc execution test
XPASS: 22_locale/money_put_members_char.cc execution test
XPASS: 22_locale/money_put_members_wchar_t.cc execution test
XPASS: 22_locale/moneypunct_byname.cc execution test
XPASS: 22_locale/moneypunct_members_char.cc execution test
XPASS: 22_locale/moneypunct_members_wchar_t.cc execution test
XPASS: 22_locale/num_get_members_char.cc execution test
XPASS: 22_locale/num_get_members_wchar_t.cc execution test
XPASS: 22_locale/num_put_members_char.cc execution test
XPASS: 22_locale/num_put_members_wchar_t.cc execution test
XPASS: 22_locale/numpunct_byname.cc execution test
XPASS: 22_locale/numpunct_members_char.cc execution test
XPASS: 22_locale/numpunct_members_wchar_t.cc execution test
XPASS: 22_locale/time_get_members_char.cc execution test
XPASS: 22_locale/time_get_members_wchar_t.cc execution test
XPASS: 22_locale/time_put_members_char.cc execution test
XPASS: 22_locale/time_put_members_wchar_t.cc execution test
FAIL: 25_algorithms/sort.cc (test for excess errors)

		=== libstdc++-v3 Summary ===

# of expected passes		452
# of unexpected failures	1
# of unexpected successes	23
# of expected failures		5

Compiler version: 3.3 20030623 (Red Hat Linux 3.3-12) 
Platform: ia64-unknown-linux-gnu
configure flags: --host=ia64-unknown-linux-gnu --enable-clocale=gnu --with-system-zlib
--enable-shared --enable-threads=posix --enable-haifa --disable-checking
--prefix=/usr/gcc-3.3-redhat --with-local-prefix=/usr/local

David.Billinghurst | 1 Jul 02:41 2003

Results for 3.5-tree-ssa 20030630 (merged 20030525) testsuite on mips-sgi-irix6.5

Native configuration is mips-sgi-irix6.5

		=== g++ tests ===

Running target unix
FAIL: g++.dg/abi/mangle2.C execution test
WARNING: program timed out.
FAIL: g++.dg/eh/cleanup1.C (test for excess errors)
FAIL: g++.dg/ext/pretty1.C scan-assembler int bar\\(T\\).*with T = int
FAIL: g++.dg/ext/pretty1.C scan-assembler top level
FAIL: g++.dg/ext/pretty1.C scan-assembler int main\\(\\)
FAIL: g++.dg/ext/pretty1.C scan-assembler int bar\\(T\\).*with T = double
FAIL: g++.dg/ext/pretty1.C scan-assembler int bar\\(T\\).*with T = unsigned char*
FAIL: g++.dg/ext/pretty2.C (test for excess errors)
WARNING: g++.dg/ext/pretty2.C compilation failed to produce executable
FAIL: g++.dg/init/new4.C (test for excess errors)
FAIL: g++.dg/opt/vtgc1.C scan-assembler-dem .vtable_inherit[ 	]*vtable for Multivv3.*0
FAIL: g++.dg/opt/vtgc1.C scan-assembler-dem .vtable_inherit[ 	]*VTT for Multivv3.*0
FAIL: g++.dg/opt/vtgc1.C scan-assembler-dem .vtable_inherit[ 	]*vtable for Multiss2.*vtable for Base2
FAIL: g++.dg/opt/vtgc1.C scan-assembler-dem .vtable_inherit[ 	]*vtable for Multivs1.*vtable for Base2
FAIL: g++.dg/opt/vtgc1.C scan-assembler-dem .vtable_inherit[ 	]*VTT for Multivs1.*vtable for Base2
FAIL: g++.dg/opt/vtgc1.C scan-assembler-dem .vtable_inherit[ 	]*vtable for Multisv0.*vtable for Side0
FAIL: g++.dg/opt/vtgc1.C scan-assembler-dem .vtable_inherit[ 	]*VTT for Multisv0.*vtable for Side0
FAIL: g++.dg/opt/vtgc1.C scan-assembler-dem .vtable_inherit[ 	]*vtable for Side0.*0
FAIL: g++.dg/opt/vtgc1.C scan-assembler-dem .vtable_inherit[ 	]*vtable for VbasedA.*0
FAIL: g++.dg/opt/vtgc1.C scan-assembler-dem .vtable_inherit[ 	]*VTT for VbasedA.*0
FAIL: g++.dg/opt/vtgc1.C scan-assembler-dem .vtable_inherit[ 	]*vtable for Base2.*vtable for Base1
FAIL: g++.dg/opt/vtgc1.C scan-assembler-dem .vtable_inherit[ 	]*vtable for Base1.*vtable for Base0
FAIL: g++.dg/opt/vtgc1.C scan-assembler-dem .vtable_inherit[ 	]*vtable for Base0.*0
FAIL: 23:is 2:should be 1
FAIL: g++.dg/gcov/gcov-2.C gcov: 1 failures in line counts, 0 in branch percentages, 0 in return percentages
FAIL: g++.dg/pch/system-1.C -g assembly comparison
FAIL: g++.dg/pch/system-1.C -O2 -g assembly comparison
FAIL: g++.dg/pch/system-1.C -O2 assembly comparison
FAIL: g++.dg/pch/system-2.C -g assembly comparison
FAIL: g++.dg/pch/system-2.C -O2 -g assembly comparison
FAIL: g++.dg/pch/system-2.C -O2 assembly comparison
FAIL: g++.old-deja/g++.jason/thunk3.C (test for excess errors)
WARNING: g++.old-deja/g++.jason/thunk3.C compilation failed to produce executable
FAIL: g++.old-deja/g++.law/profile1.C (test for excess errors)
WARNING: g++.old-deja/g++.law/profile1.C compilation failed to produce executable
FAIL: g++.old-deja/g++.mike/net20.C (test for excess errors)
WARNING: g++.old-deja/g++.mike/p10769a.C compilation failed to produce executable
XPASS: g++.old-deja/g++.oliva/template1.C  (test for errors, line 14)
FAIL: g++.old-deja/g++.other/comdat1.C (test for excess errors)
WARNING: g++.old-deja/g++.other/comdat1.C compilation failed to produce executable
FAIL: g++.old-deja/g++.other/comdat2.C (test for excess errors)
WARNING: g++.old-deja/g++.other/comdat2.C compilation failed to produce executable
FAIL: g++.old-deja/g++.other/comdat3.C (test for excess errors)
WARNING: g++.old-deja/g++.other/comdat3.C compilation failed to produce executable
FAIL: g++.old-deja/g++.other/ctor1.C (test for excess errors)
WARNING: g++.old-deja/g++.other/ctor1.C compilation failed to produce executable
WARNING: g++.old-deja/g++.other/enum5.C compilation failed to produce executable
FAIL: g++.old-deja/g++.other/vaarg3.C  (test for errors, line 23)
FAIL: g++.old-deja/g++.other/vaarg3.C  (test for errors, line 26)
WARNING: g++.old-deja/g++.pt/friend44.C compilation failed to produce executable
FAIL: g++.old-deja/g++.pt/instantiate5.C (test for excess errors)

		=== g++ Summary ===

# of expected passes		8208
# of unexpected failures	40
# of unexpected successes	1
# of expected failures		69
# of unsupported tests		46
/d5/billingd/obj/gcc-tree-ssa/gcc/testsuite/../g++ version 3.5-tree-ssa 20030630 (merged 20030525)

		=== g77 tests ===

Running target unix
FAIL: g77.f-torture/execute/980520-1.f compilation,  -O0 

		=== g77 Summary ===

# of expected passes		1722
# of unexpected failures	1
# of untested testcases		1
# of unsupported tests		6
/d5/billingd/obj/gcc-tree-ssa/gcc/testsuite/../g77 version 3.5-tree-ssa 20030630 (merged 20030525)

		=== gcc tests ===

Running target unix
FAIL: gcc.c-torture/compile/simd-5.c,  -O2  
FAIL: gcc.c-torture/compile/simd-5.c,  -O3 -fomit-frame-pointer  
FAIL: gcc.c-torture/compile/simd-5.c,  -O3 -g  
FAIL: gcc.c-torture/compile/simd-5.c,  -Os  
WARNING: program timed out.
FAIL: gcc.c-torture/compile/20001226-1.c,  -O1  
WARNING: program timed out.
FAIL: gcc.c-torture/compile/20001226-1.c,  -O2  
WARNING: program timed out.
FAIL: gcc.c-torture/compile/20001226-1.c,  -O3 -fomit-frame-pointer  
WARNING: program timed out.
FAIL: gcc.c-torture/compile/20001226-1.c,  -O3 -g  
WARNING: program timed out.
FAIL: gcc.c-torture/compile/20001226-1.c,  -Os  
XPASS: gcc.c-torture/execute/builtins/string-4.c execution,  -O0 
XPASS: gcc.c-torture/execute/builtins/string-5.c execution,  -O0 
FAIL: gcc.c-torture/execute/20020412-1.c execution,  -O0 
FAIL: gcc.c-torture/execute/20020412-1.c execution,  -O1 
FAIL: gcc.c-torture/execute/20020412-1.c execution,  -O2 
FAIL: gcc.c-torture/execute/20020412-1.c execution,  -O3 -fomit-frame-pointer 
FAIL: gcc.c-torture/execute/20020412-1.c execution,  -O3 -fomit-frame-pointer -funroll-loops 
FAIL: gcc.c-torture/execute/20020412-1.c execution,  -O3 -fomit-frame-pointer -funroll-all-loops
-finline-functions 
FAIL: gcc.c-torture/execute/20020412-1.c execution,  -O3 -g 
FAIL: gcc.c-torture/execute/20020412-1.c execution,  -Os 
FAIL: gcc.dg/compat/struct-by-value-2 c_compat_x_tst.o-c_compat_y_tst.o execute 
FAIL: gcc.dg/compat/struct-by-value-3 c_compat_x_tst.o-c_compat_y_tst.o execute 
FAIL: gcc.dg/compat/struct-by-value-4 c_compat_x_tst.o-c_compat_y_tst.o execute 
FAIL: gcc.dg/compat/struct-by-value-5 c_compat_x_tst.o-c_compat_y_tst.o execute 
FAIL: gcc.dg/compat/struct-by-value-8 c_compat_x_tst.o-c_compat_y_tst.o execute 
FAIL: gcc.dg/compat/struct-by-value-9 c_compat_x_tst.o-c_compat_y_tst.o execute 
FAIL: gcc.dg/compat/struct-return-2 c_compat_x_tst.o-c_compat_y_tst.o execute 
FAIL: gcc.dg/compat/struct-return-3 c_compat_x_tst.o-c_compat_y_tst.o execute 
FAIL: gcc.dg/cpp/ucs.c (test for excess errors)
FAIL: gcc.dg/20010516-1.c (test for excess errors)
FAIL: gcc.dg/20020304-1.c (test for excess errors)
WARNING: gcc.dg/20021014-1.c compilation failed to produce executable
FAIL: gcc.dg/20030331-2.c (test for excess errors)
FAIL: gcc.dg/Wunreachable-2.c (test for excess errors)
FAIL: gcc.dg/Wunreachable-4.c (test for excess errors)
ERROR: gcc.dg/const-elim-2.c: error executing dg-final: bad switch "-inline": must be -indices,
-nocase, or --
UNRESOLVED: gcc.dg/const-elim-2.c: error executing dg-final: bad switch "-inline": must be -indices,
-nocase, or --
WARNING: gcc.dg/nest.c compilation failed to produce executable
XPASS: gcc.dg/sibcall-3.c execution test
XPASS: gcc.dg/sibcall-4.c execution test
XPASS: gcc.dg/uninit-4.c uninitialized variable warning (test for bogus messages, line 26)
XPASS: gcc.dg/uninit-5.c uninitialized variable warning (test for bogus messages, line 13)
XPASS: gcc.dg/uninit-5.c uninitialized variable warning (test for bogus messages, line 27)
XPASS: gcc.dg/uninit-8.c uninitialized variable warning (test for bogus messages, line 14)
FAIL: gcc.dg/unused-5.c scan-assembler string_to_look_for
FAIL: gcc.dg/warn-1.c  (test for warnings, line 8)
FAIL: gcc.dg/warn-1.c  (test for warnings, line 15)
FAIL: gcc.dg/warn-1.c (test for excess errors)
FAIL: gcc.dg/pch/static-1.c  -O0  assembly comparison
FAIL: gcc.dg/pch/static-1.c  -O1  assembly comparison
FAIL: gcc.dg/pch/static-1.c  -O2  assembly comparison
FAIL: gcc.dg/pch/static-1.c  -Os  assembly comparison
FAIL: gcc.dg/pch/static-2.c  -O0  assembly comparison
FAIL: gcc.dg/pch/static-2.c  -O1  assembly comparison
FAIL: gcc.dg/pch/static-2.c  -O2  assembly comparison
FAIL: gcc.dg/pch/static-2.c  -Os  assembly comparison
FAIL: gcc.dg/pch/static-3.c  -O0  assembly comparison
FAIL: gcc.dg/pch/static-3.c  -O1  assembly comparison
FAIL: gcc.dg/pch/static-3.c  -O2  assembly comparison
FAIL: gcc.dg/pch/static-3.c  -Os  assembly comparison
ERROR: gcc.dg/tree-ssa/20030530-2.c: error executing dg-final: bad switch "-inline": must be
-indices, -nocase, or --
UNRESOLVED: gcc.dg/tree-ssa/20030530-2.c: error executing dg-final: bad switch "-inline": must be
-indices, -nocase, or --
ERROR: gcc.dg/tree-ssa/20030611-1.c: error executing dg-final: bad switch "-inline": must be
-indices, -nocase, or --
UNRESOLVED: gcc.dg/tree-ssa/20030611-1.c: error executing dg-final: bad switch "-inline": must be
-indices, -nocase, or --

		=== gcc Summary ===

# of expected passes		21764
# of unexpected failures	47
# of unexpected successes	8
# of expected failures		109
# of unresolved testcases	3
# of unsupported tests		217
/d5/billingd/obj/gcc-tree-ssa/gcc/xgcc version 3.5-tree-ssa 20030630 (merged 20030525)

		=== objc tests ===

Running target unix

		=== objc Summary ===

# of expected passes		1156
/d5/billingd/obj/gcc-tree-ssa/gcc/xgcc version 3.5-tree-ssa 20030630 (merged 20030525)

		=== libstdc++-v3 tests ===

Running target unix
FAIL: 22_locale/ctype/cons/char/1.cc execution test
FAIL: 26_numerics/fabs_inline.cc (test for excess errors)
WARNING: 26_numerics/fabs_inline.cc compilation failed to produce executable
FAIL: 27_io/basic_filebuf/showmanyc/char/9533-2.cc execution test
FAIL: 27_io/basic_istream/readsome/char/6746-2.cc execution test

		=== libstdc++-v3 Summary ===

# of expected passes		1372
# of unexpected failures	4
# of unsupported tests		7

Compiler version: 3.5-tree-ssa 20030630 (merged 20030525) 
Platform: mips-sgi-irix6.5
configure flags: --enable-shared --enable-haifa --disable-libgcj
--enable-languages=c,c++,f77,objc --enable-threads=single --disable-nls --disable-c-mbchar
--enable-werror=no --disable-libmudflap --disable-multilib
--prefix=/d5/billingd/tmp/gcc-tree-ssa --with-libbanshee
Counting all warnings,
there are 39 warnings in stage3 of this bootstrap.

Number of warnings per file:
  14 gcc/config/mips/mips.md
   6 gcc/gthr-gnat.c
   4 gcc/gcc.c
   2 insn-conditions.c
   2 gcc/reload1.c
   2 gcc/objc/lang-specs.h
   2 gcc/gthr-gnat.h
   2 gcc/f/sta.c
   2 gcc/bitmap.c
   2 /usr/local/share/bison/bison.simple
   1 gcc/expr.c

Number of warning types:
   8 operand 1 missing mode?
   7 string length \`???' is greater than the length \`???' ISO C89 compilers are required to support
   6 operand 0 missing mode?
   6 function declaration isn't a prototype
   6 \`???' might be used uninitialized in this function
   2 no previous prototype for \`???'
   2 label \`???' defined but not used
   2 dereferencing type-punned pointer will break strict-aliasing rules

Robert Schiele | 1 Jul 03:08 2003
Picon

Results for 3.4 20030630 (experimental) testsuite on i486-suse-linux-gnu

Attachment: application/octet-stream, 2676 bytes
Loren James Rittle | 1 Jul 03:10 2003
Picon

Results for 3.3.1 20030630 (prerelease) testsuite on alpha-unknown-freebsd5.1

Using gmake with objdir configuration on beast (see key)

LAST_UPDATED: Mon Jun 30 20:53:52 GMT 2003

Native configuration is alpha-unknown-freebsd5.1

		=== libjava tests ===

Running target unix/-pthread
FAIL: SyncTest execution - source compiled test
FAIL: SyncTest -O execution - source compiled test
FAIL: Thread_Monitor -O execution - bytecode->native test
FAIL: Throw_2 execution - source compiled test
FAIL: Throw_2 execution - gij test
FAIL: Throw_2 execution - bytecode->native test
FAIL: Throw_2 -O execution - source compiled test
FAIL: Throw_2 execution - gij test
FAIL: Throw_2 -O execution - bytecode->native test
FAIL: initexc execution - gij test
FAIL: initexc execution - gij test

		=== libjava Summary ===

# of expected passes		2969
# of unexpected failures	11
# of expected failures		16
# of untested testcases		23
		=== libstdc++-v3 tests ===

Running target unix/-pthread
FAIL: 18_support/numeric_limits.cc execution test
XPASS: 22_locale/ctype_is_wchar_t.cc execution test
WARNING: program timed out.
FAIL: 27_io/filebuf_virtuals.cc execution test

		=== libstdc++-v3 Summary ===

# of expected passes		451
# of unexpected failures	2
# of unexpected successes	1
# of expected failures		27
		=== g++ tests ===

Running target unix/-pthread
FAIL: g++.dg/expr/anew1.C execution test
FAIL: g++.dg/expr/anew2.C execution test
FAIL: g++.dg/expr/anew3.C execution test
FAIL: g++.dg/expr/anew4.C execution test
FAIL: g++.dg/other/error5.C  (test for errors, line 10)
FAIL: g++.dg/other/error5.C (test for excess errors)
FAIL: g++.dg/tls/init-2.C (test for excess errors)
FAIL: g++.eh/badalloc1.C  Execution test
FAIL: g++.law/profile1.C (test for excess errors)
FAIL: g++.pt/repo3.C (test for excess errors)

		=== g++ Summary ===

# of expected passes		7987
# of unexpected failures	10
# of expected failures		96
# of untested testcases		22
# of unsupported tests		17
/j/ljrittle/gcc-build-beast-0630/gcc/testsuite/../g++ version 3.3.1 20030630 (prerelease)

		=== g77 tests ===

Running target unix/-pthread

		=== g77 Summary ===

# of expected passes		1686
# of unsupported tests		8
/j/ljrittle/gcc-build-beast-0630/gcc/testsuite/../g77 version 3.3.1 20030630 (prerelease)

		=== gcc tests ===

Running target unix/-pthread
FAIL: gcc.c-torture/execute/20020227-1.c compilation,  -O0 
UNRESOLVED: gcc.c-torture/execute/20020227-1.c execution,  -O0 
FAIL: gcc.c-torture/execute/20020227-1.c compilation,  -O1 
UNRESOLVED: gcc.c-torture/execute/20020227-1.c execution,  -O1 
FAIL: gcc.c-torture/execute/20020227-1.c compilation,  -O2 
UNRESOLVED: gcc.c-torture/execute/20020227-1.c execution,  -O2 
FAIL: gcc.c-torture/execute/20020227-1.c compilation,  -O3 -fomit-frame-pointer 
UNRESOLVED: gcc.c-torture/execute/20020227-1.c execution,  -O3 -fomit-frame-pointer 
FAIL: gcc.c-torture/execute/20020227-1.c compilation,  -O3 -g 
UNRESOLVED: gcc.c-torture/execute/20020227-1.c execution,  -O3 -g 
FAIL: gcc.c-torture/execute/20020227-1.c compilation,  -Os 
UNRESOLVED: gcc.c-torture/execute/20020227-1.c execution,  -Os 
FAIL: gcc.c-torture/execute/simd-2.c compilation,  -O3 -fomit-frame-pointer 
UNRESOLVED: gcc.c-torture/execute/simd-2.c execution,  -O3 -fomit-frame-pointer 
FAIL: gcc.c-torture/execute/simd-2.c compilation,  -O3 -g 
UNRESOLVED: gcc.c-torture/execute/simd-2.c execution,  -O3 -g 
FAIL: gcc.dg/20020607-2.c (test for excess errors)
WARNING: gcc.dg/20020607-2.c compilation failed to produce executable
FAIL: gcc.dg/20021014-1.c (test for excess errors)
WARNING: gcc.dg/20021014-1.c compilation failed to produce executable
FAIL: gcc.dg/duff-2.c (test for excess errors)
FAIL: gcc.dg/fastmath-1.c (test for excess errors)
WARNING: gcc.dg/fastmath-1.c compilation failed to produce executable
FAIL: gcc.dg/fnegate-1.c (test for excess errors)
WARNING: gcc.dg/fnegate-1.c compilation failed to produce executable
FAIL: gcc.dg/nest.c (test for excess errors)
WARNING: gcc.dg/nest.c compilation failed to produce executable

		=== gcc Summary ===

# of expected passes		21294
# of unexpected failures	14
# of expected failures		72
# of unresolved testcases	8
# of unsupported tests		166
/j/ljrittle/gcc-build-beast-0630/gcc/xgcc version 3.3.1 20030630 (prerelease)

		=== objc tests ===

Running target unix/-pthread

		=== objc Summary ===

# of expected passes		1153
/j/ljrittle/gcc-build-beast-0630/gcc/xgcc version 3.3.1 20030630 (prerelease)

Compiler version: 3.3.1 20030630 (prerelease) 
Platform: alpha-unknown-freebsd5.1
configure flags: --host=alpha-unknown-freebsd5.1
--prefix=/home/ljrittle/beast/tmp/install-beast --with-gnu-as --with-as=/usr/bin/as
--with-gnu-ld --with-ld=/usr/bin/ld
BOOT_CFLAGS=-g -O2
Key: gmake is GNU make
     make is BSD make as shipped on alpha-unknown-freebsd5.1
     srcdir means in-source configuration was done within the gcc source tree
     objdir means out-source configuration was done within a fresh directory
ref4 (3.3) and ref5 (mainline) attempt to build gcc twice daily;
once for srcdir configuration and once for objdir configuration;
odd number days use GNU make; even days use BSD make; missing
reports infer breakage; partial reports are made when bootstap
completes in gcc but fails in a support library.
beast (3.3) builds gcc once daily using gmake with objdir conf.
See http://people.freebsd.org/~ljrittle/daily-gcc-bootstrap-reports
for all related transcript logs and log.sent files (not staged
until after all daily bootstraps for a machine complete).

Joern Rennecke | 1 Jul 03:56 2003

Results for 3.4 20030630 (experimental) testsuite on sh-unknown-elf

LAST_UPDATED: 2003-06-30 22:00 UTC

Target is sh-unknown-elf
Host   is i686-pc-linux-gnu

		=== g++ tests ===

Running target sh-hms-sim
FAIL: g++.dg/ext/pretty1.C scan-assembler top level
FAIL: g++.dg/ext/pretty2.C (test for excess errors)
WARNING: g++.dg/ext/pretty2.C compilation failed to produce executable
FAIL: g++.dg/init/array10.C (test for excess errors)
XPASS: g++.old-deja/g++.jason/thunk3.C execution test
WARNING: g++.old-deja/g++.mike/p10769a.C compilation failed to produce executable
WARNING: g++.old-deja/g++.other/enum5.C compilation failed to produce executable
WARNING: g++.old-deja/g++.pt/friend44.C compilation failed to produce executable

		=== g++ Summary for sh-hms-sim ===

# of expected passes		8574
# of unexpected failures	3
# of unexpected successes	1
# of expected failures		68
# of unsupported tests		53

Running target sh-hms-sim/-m4/-ml
FAIL: g++.dg/ext/pretty1.C scan-assembler top level
FAIL: g++.dg/ext/pretty2.C (test for excess errors)
WARNING: g++.dg/ext/pretty2.C compilation failed to produce executable
FAIL: g++.dg/init/array10.C (test for excess errors)
XPASS: g++.old-deja/g++.jason/thunk3.C execution test
WARNING: g++.old-deja/g++.mike/p10769a.C compilation failed to produce executable
WARNING: g++.old-deja/g++.other/enum5.C compilation failed to produce executable
WARNING: g++.old-deja/g++.pt/friend44.C compilation failed to produce executable

		=== g++ Summary for sh-hms-sim/-m4/-ml ===

# of expected passes		8574
# of unexpected failures	3
# of unexpected successes	1
# of expected failures		68
# of unsupported tests		53

		=== g++ Summary ===

# of expected passes		17148
# of unexpected failures	6
# of unexpected successes	2
# of expected failures		136
# of unsupported tests		106
/swbuild/nightly/2003-06-30/sh-elf/gcc/testsuite/../g++ version 3.4 20030630 (experimental)

Host   is i686-pc-linux-gnu

		=== gcc tests ===

Running target sh-hms-sim
UNRESOLVED: gcc.c-torture/execute/20020720-1.c execution,  -O1 
UNRESOLVED: gcc.c-torture/execute/20020720-1.c execution,  -O2 
UNRESOLVED: gcc.c-torture/execute/20020720-1.c execution,  -O3 -fomit-frame-pointer 
UNRESOLVED: gcc.c-torture/execute/20020720-1.c execution,  -O3 -g 
UNRESOLVED: gcc.c-torture/execute/20020720-1.c execution,  -Os 
FAIL: gcc.dg/20030626-1.c  (test for bogus messages, line 17)
FAIL: gcc.dg/asm-names.c (test for excess errors)
FAIL: gcc.dg/builtins-10.c (test for excess errors)
FAIL: gcc.dg/builtins-18.c (test for excess errors)
FAIL: gcc.dg/builtins-20.c (test for excess errors)
XPASS: gcc.dg/uninit-4.c uninitialized variable warning (test for bogus messages, line 26)
FAIL: gcc.dg/warn-1.c  (test for warnings, line 15)

		=== gcc Summary for sh-hms-sim ===

# of expected passes		23285
# of unexpected failures	6
# of unexpected successes	1
# of expected failures		77
# of unresolved testcases	5
# of unsupported tests		264

Running target sh-hms-sim/-m4/-ml
WARNING: program timed out.
FAIL: gcc.c-torture/compile/20001226-1.c  -O3 -g  (test for excess errors)
UNRESOLVED: gcc.c-torture/execute/20020720-1.c execution,  -O1 
UNRESOLVED: gcc.c-torture/execute/20020720-1.c execution,  -O2 
UNRESOLVED: gcc.c-torture/execute/20020720-1.c execution,  -O3 -fomit-frame-pointer 
UNRESOLVED: gcc.c-torture/execute/20020720-1.c execution,  -O3 -g 
UNRESOLVED: gcc.c-torture/execute/20020720-1.c execution,  -Os 
FAIL: gcc.dg/20030626-1.c  (test for bogus messages, line 17)
FAIL: gcc.dg/asm-names.c (test for excess errors)
FAIL: gcc.dg/builtins-20.c (test for excess errors)
XPASS: gcc.dg/uninit-4.c uninitialized variable warning (test for bogus messages, line 26)
FAIL: gcc.dg/warn-1.c  (test for warnings, line 15)

		=== gcc Summary for sh-hms-sim/-m4/-ml ===

# of expected passes		23286
# of unexpected failures	5
# of unexpected successes	1
# of expected failures		77
# of unresolved testcases	5
# of unsupported tests		264

		=== gcc Summary ===

# of expected passes		46571
# of unexpected failures	11
# of unexpected successes	2
# of expected failures		154
# of unresolved testcases	10
# of unsupported tests		528
/swbuild/nightly/2003-06-30/sh-elf/gcc/xgcc version 3.4 20030630 (experimental)

Host   is i686-pc-linux-gnu

		=== objc tests ===

Running target sh-hms-sim

		=== objc Summary for sh-hms-sim ===

# of expected passes		1156

Running target sh-hms-sim/-m4/-ml

		=== objc Summary for sh-hms-sim/-m4/-ml ===

# of expected passes		1156

		=== objc Summary ===

# of expected passes		2312
/swbuild/nightly/2003-06-30/sh-elf/gcc/xgcc version 3.4 20030630 (experimental)

Compiler version: 3.4 20030630 (experimental) 
Platform: sh-unknown-elf
configure flags: --cache-file=.././config.cache --build=i686-pc-linux-gnu
--host=i686-pc-linux-gnu --target=sh-elf --with-gnu-as --with-gnu-ld --with-newlib
--with-headers --with-newlib --srcdir=../../srcw/gcc

Kai Henningsen | 1 Jul 04:18 2003
Picon

Results for 3.5-tree-ssa 20030629 (merged 20030525) testsuite on i686-pc-linux-gnu

LAST_UPDATED: Mon Jun 30 17:59:20 UTC 2003

Native configuration is i686-pc-linux-gnu

		=== g77 tests ===

Running target unix
FAIL: g77.f-torture/execute/980520-1.f compilation,  -O0 

		=== g77 Summary ===

# of expected passes		1734
# of unexpected failures	1
# of untested testcases		1
gcc version 3.5-tree-ssa 20030629 (merged 20030525)

		=== gcc tests ===

Running target unix
WARNING: program timed out.
FAIL: gcc.c-torture/compile/20001226-1.c,  -O3 -fomit-frame-pointer  
WARNING: program timed out.
FAIL: gcc.c-torture/compile/20001226-1.c,  -O3 -g  
XPASS: gcc.c-torture/execute/builtins/string-4.c execution,  -O0 
XPASS: gcc.c-torture/execute/builtins/string-5.c execution,  -O0 
XPASS: gcc.c-torture/execute/builtins/string-4.c execution,  -O0 
XPASS: gcc.c-torture/execute/builtins/string-5.c execution,  -O0 
FAIL: gcc.c-torture/execute/20000603-1.c execution,  -O3 -fomit-frame-pointer 
FAIL: gcc.c-torture/execute/20000603-1.c execution,  -O3 -g 
FAIL: gcc.dg/20010516-1.c (test for excess errors)
FAIL: gcc.dg/20020304-1.c (test for excess errors)
FAIL: gcc.dg/20020531-1.c (test for excess errors)
FAIL: gcc.dg/20030331-2.c (test for excess errors)
FAIL: gcc.dg/Wunreachable-4.c (test for excess errors)
XPASS: gcc.dg/uninit-4.c uninitialized variable warning (test for bogus messages, line 26)
XPASS: gcc.dg/uninit-5.c uninitialized variable warning (test for bogus messages, line 13)
XPASS: gcc.dg/uninit-5.c uninitialized variable warning (test for bogus messages, line 27)
XPASS: gcc.dg/uninit-8.c uninitialized variable warning (test for bogus messages, line 14)
FAIL: gcc.dg/uninit-C.c (test for excess errors)
FAIL: gcc.dg/warn-1.c  (test for warnings, line 8)
FAIL: gcc.dg/warn-1.c  (test for warnings, line 15)
FAIL: gcc.dg/warn-1.c (test for excess errors)
FAIL: gcc.dg/pch/static-3.c  -O2  assembly comparison
FAIL: gcc.dg/tls/opt-6.c (test for excess errors)

		=== gcc Summary ===

# of expected passes		23078
# of unexpected failures	15
# of unexpected successes	8
# of expected failures		90
# of unsupported tests		101
gcc version 3.5-tree-ssa 20030629 (merged 20030525)

		=== g++ tests ===

Running target unix
FAIL: g++.dg/eh/simd-2.C (test for excess errors)
WARNING: g++.dg/eh/simd-2.C compilation failed to produce executable
FAIL: g++.dg/ext/pretty1.C scan-assembler top level
FAIL: g++.dg/ext/pretty2.C (test for excess errors)
WARNING: g++.dg/ext/pretty2.C compilation failed to produce executable
FAIL: 23:is 2:should be 1
FAIL: g++.dg/gcov/gcov-2.C gcov: 1 failures in line counts, 0 in branch percentages, 0 in return percentages
WARNING: g++.old-deja/g++.mike/p10769a.C compilation failed to produce executable
XPASS: g++.old-deja/g++.oliva/template1.C  (test for errors, line 14)
WARNING: g++.old-deja/g++.other/enum5.C compilation failed to produce executable
FAIL: g++.old-deja/g++.other/vaarg3.C  (test for errors, line 23)
FAIL: g++.old-deja/g++.other/vaarg3.C  (test for errors, line 26)
WARNING: g++.old-deja/g++.pt/friend44.C compilation failed to produce executable

		=== g++ Summary ===

# of expected passes		8589
# of unexpected failures	7
# of unexpected successes	1
# of expected failures		68
# of unsupported tests		15
gcc version 3.5-tree-ssa 20030629 (merged 20030525)

		=== objc tests ===

Running target unix

		=== objc Summary ===

# of expected passes		1156
gcc version 3.5-tree-ssa 20030629 (merged 20030525)

		=== libjava tests ===

Running target unix
FAIL: Thread_Interrupt output - bytecode->native test

		=== libjava Summary ===

# of expected passes		3018
# of unexpected failures	1
# of expected failures		16
# of untested testcases		12
		=== libmudflap tests ===

Running target unix
FAIL: libmudflap.c/fail13-frag.c (-O2) crash test
FAIL: libmudflap.c/fail13-frag.c (-O2) output pattern test
FAIL: libmudflap.c/fail13-frag.c (-O3) crash test
FAIL: libmudflap.c/fail13-frag.c (-O3) output pattern test

		=== libmudflap Summary ===

# of expected passes		656
# of unexpected failures	4
		=== libstdc++-v3 tests ===

Running target unix
XPASS: 26_numerics/c99_classification_macros_c.cc (test for excess errors)

		=== libstdc++-v3 Summary ===

# of expected passes		1854
# of unexpected successes	1

Compiler version: 3.5-tree-ssa 20030629 (merged 20030525) 
Platform: i686-pc-linux-gnu
configure flags: --prefix=/opt/gcc-tree-ssa-20020619-branch --enable-multilib
--enable-checking --enable-c-mbchar --enable-threads --enable-nls
--enable-version-specific-runtime-libs --enable-languages=c++,f77,java,objc --with-libbanshee

Loren James Rittle | 1 Jul 04:44 2003
Picon

Results for 3.3.1 20030630 (prerelease) testsuite on i386-unknown-freebsd4.8

Using gmake with objdir configuration on ref4 (see key)

LAST_UPDATED: Mon Jun 30 20:53:52 GMT 2003

Native configuration is i386-unknown-freebsd4.8

		=== g++ tests ===

Running target unix/-pthread
FAIL: g++.dg/other/error5.C  (test for errors, line 10)
FAIL: g++.dg/other/error5.C (test for excess errors)
FAIL: g++.eh/badalloc1.C  Execution test
FAIL: g++.law/profile1.C (test for excess errors)

		=== g++ Summary ===

# of expected passes		8016
# of unexpected failures	4
# of expected failures		96
# of untested testcases		12
# of unsupported tests		4
/local0/scratch/ljrittle/gcc-build-ref4-0630/gcc/testsuite/../g++ version 3.3.1 20030630 (prerelease)

		=== g77 tests ===

Running target unix/-pthread

		=== g77 Summary ===

# of expected passes		1686
# of unsupported tests		8
/local0/scratch/ljrittle/gcc-build-ref4-0630/gcc/testsuite/../g77 version 3.3.1 20030630 (prerelease)

		=== gcc tests ===

Running target unix/-pthread
FAIL: gcc.c-torture/execute/conversion.c execution,  -O0 
FAIL: gcc.c-torture/execute/conversion.c execution,  -O1 
FAIL: gcc.c-torture/execute/conversion.c execution,  -O2 
FAIL: gcc.c-torture/execute/conversion.c execution,  -Os 
FAIL: gcc.dg/duff-2.c (test for excess errors)
FAIL: gcc.dg/nest.c (test for excess errors)
WARNING: gcc.dg/nest.c compilation failed to produce executable
FAIL: gcc.dg/uninit-C.c (test for excess errors)
FAIL: gcc.dg/format/c99-scanf-3.c   vfscanf (test for warnings, line 21)
FAIL: gcc.dg/format/c99-scanf-3.c  -DWIDE  vfscanf (test for warnings, line 21)
FAIL: gcc.dg/format/ext-6.c   vfscanf (test for warnings, line 42)
FAIL: gcc.dg/format/ext-6.c  -DWIDE  vfscanf (test for warnings, line 42)

		=== gcc Summary ===

# of expected passes		21489
# of unexpected failures	11
# of expected failures		68
# of unsupported tests		86
/local0/scratch/ljrittle/gcc-build-ref4-0630/gcc/xgcc version 3.3.1 20030630 (prerelease)

		=== objc tests ===

Running target unix/-pthread

		=== objc Summary ===

# of expected passes		1153
/local0/scratch/ljrittle/gcc-build-ref4-0630/gcc/xgcc version 3.3.1 20030630 (prerelease)

		=== libjava tests ===

Running target unix/-pthread
WARNING: program timed out.
FAIL: invoke run
WARNING: program timed out.
FAIL: PR260 execution - gij test
WARNING: program timed out.
FAIL: PR6085 execution - gij test
WARNING: program timed out.
FAIL: PR6820 execution - gij test
FAIL: SyncGlobal -O execution - bytecode->native test
WARNING: program timed out.
FAIL: SyncTest execution - gij test
WARNING: program timed out.
FAIL: SyncTest execution - bytecode->native test
WARNING: program timed out.
FAIL: SyncTest execution - gij test
WARNING: program timed out.
FAIL: SyncTest -O execution - bytecode->native test
FAIL: Thread_Sleep output - source compiled test
FAIL: Thread_Sleep output - bytecode->native test
FAIL: Thread_Sleep -O output - source compiled test
FAIL: Throw_2 execution - source compiled test
FAIL: Throw_2 execution - gij test
FAIL: Throw_2 execution - bytecode->native test
FAIL: Throw_2 -O execution - source compiled test
FAIL: Throw_2 execution - gij test
FAIL: Throw_2 -O execution - bytecode->native test

		=== libjava Summary ===

# of expected passes		2959
# of unexpected failures	18
# of expected failures		16
# of untested testcases		27
		=== libstdc++-v3 tests ===

Running target unix/-pthread

		=== libstdc++-v3 Summary ===

# of expected passes		430
# of expected failures		17

Compiler version: 3.3.1 20030630 (prerelease) 
Platform: i386-unknown-freebsd4.8
configure flags: --host=i386-unknown-freebsd4.8 --prefix=/home/ljrittle/ref4/tmp/install-ref4
--with-gnu-as --with-as=/usr/bin/as --with-gnu-ld --with-ld=/usr/bin/ld
BOOT_CFLAGS=-g -O2
Key: gmake is GNU make
     make is BSD make as shipped on i386-unknown-freebsd4.8
     srcdir means in-source configuration was done within the gcc source tree
     objdir means out-source configuration was done within a fresh directory
ref4 (3.3) and ref5 (mainline) attempt to build gcc twice daily;
once for srcdir configuration and once for objdir configuration;
odd number days use GNU make; even days use BSD make; missing
reports infer breakage; partial reports are made when bootstap
completes in gcc but fails in a support library.
beast (3.3) builds gcc once daily using gmake with objdir conf.
See http://people.freebsd.org/~ljrittle/daily-gcc-bootstrap-reports
for all related transcript logs and log.sent files (not staged
until after all daily bootstraps for a machine complete).


Gmane