Jenkins QA | 27 Aug 16:05 2014

[QA] addons_nuxeo-cmf-master - Build # 1071 - Unstable!

BUILD UNSTABLE
Build URL https://qa.nuxeo.org/jenkins/job/addons_nuxeo-cmf-master/1071/
Project: addons_nuxeo-cmf-master
Date of build: Wed, 27 Aug 2014 16:03:31 +0200
Build duration: 2 min 0 sec

CHANGES
No Changes

BUILD ARTIFACTS
Nuxeo Case Management API
  • org.nuxeo.cm/nuxeo-case-management-api/5.9.6-SNAPSHOT/nuxeo-case-management-api-5.9.6-SNAPSHOT.jar
  • org.nuxeo.cm/nuxeo-case-management-api/5.9.6-SNAPSHOT/nuxeo-case-management-api-5.9.6-SNAPSHOT.pom
  • Nuxeo Case Management Core
  • org.nuxeo.cm/nuxeo-case-management-core/5.9.6-SNAPSHOT/nuxeo-case-management-core-5.9.6-SNAPSHOT.jar
  • org.nuxeo.cm/nuxeo-case-management-core/5.9.6-SNAPSHOT/nuxeo-case-management-core-5.9.6-SNAPSHOT.pom
  • Nuxeo Case Management Lang
  • org.nuxeo.cm/nuxeo-case-management-lang/5.9.6-SNAPSHOT/nuxeo-case-management-lang-5.9.6-SNAPSHOT.jar
  • org.nuxeo.cm/nuxeo-case-management-lang/5.9.6-SNAPSHOT/nuxeo-case-management-lang-5.9.6-SNAPSHOT.pom
  • Nuxeo Case Management Parent
  • org.nuxeo.cm/nuxeo-case-management-parent/5.9.6-SNAPSHOT/nuxeo-case-management-parent-5.9.6-SNAPSHOT.pom
  • Nuxeo Case Management Test
  • org.nuxeo.cm/nuxeo-case-management-test/5.9.6-SNAPSHOT/nuxeo-case-management-test-5.9.6-SNAPSHOT.jar
  • org.nuxeo.cm/nuxeo-case-management-test/5.9.6-SNAPSHOT/nuxeo-case-management-test-5.9.6-SNAPSHOT.pom
  • Nuxeo Case Management Web
  • org.nuxeo.cm/nuxeo-case-management-web/5.9.6-SNAPSHOT/nuxeo-case-management-web-5.9.6-SNAPSHOT.jar
  • org.nuxeo.cm/nuxeo-case-management-web/5.9.6-SNAPSHOT/nuxeo-case-management-web-5.9.6-SNAPSHOT.pom
  • Nuxeo Correspondence API
  • org.nuxeo.correspondence/nuxeo-correspondence-api/5.9.6-SNAPSHOT/nuxeo-correspondence-api-5.9.6-SNAPSHOT.jar
  • org.nuxeo.correspondence/nuxeo-correspondence-api/5.9.6-SNAPSHOT/nuxeo-correspondence-api-5.9.6-SNAPSHOT.pom
  • Nuxeo Correspondence Core
  • org.nuxeo.correspondence/nuxeo-correspondence-core/5.9.6-SNAPSHOT/nuxeo-correspondence-core-5.9.6-SNAPSHOT.jar
  • org.nuxeo.correspondence/nuxeo-correspondence-core/5.9.6-SNAPSHOT/nuxeo-correspondence-core-5.9.6-SNAPSHOT.pom
  • Nuxeo Correspondence Web
  • org.nuxeo.correspondence/nuxeo-correspondence-web/5.9.6-SNAPSHOT/nuxeo-correspondence-web-5.9.6-SNAPSHOT.jar
  • org.nuxeo.correspondence/nuxeo-correspondence-web/5.9.6-SNAPSHOT/nuxeo-correspondence-web-5.9.6-SNAPSHOT.pom

  • JUnit Tests
    Name: org.nuxeo.cm.mail.actionpipe.parser Failed: 0 test(s), Passed: 3 test(s), Skipped: 0 test(s), Total: 3 test(s)
    Name: org.nuxeo.cm.cases Failed: 1 test(s), Passed: 10 test(s), Skipped: 0 test(s), Total: 11 test(s)
  • Failed: org.nuxeo.cm.cases.TestMailTreeHelper.testSimple
  • Name: org.nuxeo.cm.core.adapter Failed: 0 test(s), Passed: 4 test(s), Skipped: 0 test(s), Total: 4 test(s)
    Name: org.nuxeo.cm.mailbox Failed: 0 test(s), Passed: 4 test(s), Skipped: 1 test(s), Total: 5 test(s)
    Name: org.nuxeo.cm.operation Failed: 0 test(s), Passed: 3 test(s), Skipped: 0 test(s), Total: 3 test(s)
    Name: org.nuxeo.cm.service Failed: 0 test(s), Passed: 22 test(s), Skipped: 0 test(s), Total: 22 test(s)
    Name: org.nuxeo.cm.service.synchronization Failed: 0 test(s), Passed: 4 test(s), Skipped: 1 test(s), Total: 5 test(s)
    Name: org.nuxeo.cm.usermanager Failed: 0 test(s), Passed: 1 test(s), Skipped: 0 test(s), Total: 1 test(s)
    Name: org.nuxeo.correspondence.test.generator Failed: 0 test(s), Passed: 1 test(s), Skipped: 0 test(s), Total: 1 test(s)
    Name: org.nuxeo.correspondence.test.link Failed: 0 test(s), Passed: 1 test(s), Skipped: 0 test(s), Total: 1 test(s)
    Name: org.nuxeo.correspondence.test.mailservice Failed: 0 test(s), Passed: 9 test(s), Skipped: 0 test(s), Total: 9 test(s)
    Name: org.nuxeo.correspondence.test.security Failed: 0 test(s), Passed: 1 test(s), Skipped: 0 test(s), Total: 1 test(s)

    _______________________________________________
    ECM-QA mailing list
    ECM-QA@...
    http://lists.nuxeo.com/mailman/listinfo/ecm-qa
    
    Jenkins QA | 26 Aug 20:50 2014

    [QA] addons_nuxeo-birt-5.8 - Build # 255 - Unstable!

    BUILD UNSTABLE
    Build URL https://qa.nuxeo.org/jenkins/job/addons_nuxeo-birt-5.8/255/
    Project: addons_nuxeo-birt-5.8
    Date of build: Tue, 26 Aug 2014 20:49:19 +0200
    Build duration: 57 sec

    CHANGES
    No Changes

    BUILD ARTIFACTS
    Nuxeo Birt Reporting Parent
  • org.nuxeo.ecm.platform/nuxeo-birt-parent/5.8.0-HF21-SNAPSHOT/nuxeo-birt-parent-5.8.0-HF21-SNAPSHOT.pom
  • Nuxeo Birt Reporting Core
  • org.nuxeo.ecm.platform/nuxeo-birt-reporting/5.8.0-HF21-SNAPSHOT/nuxeo-birt-reporting-5.8.0-HF21-SNAPSHOT.jar
  • org.nuxeo.ecm.platform/nuxeo-birt-reporting/5.8.0-HF21-SNAPSHOT/nuxeo-birt-reporting-5.8.0-HF21-SNAPSHOT.pom
  • Nuxeo Birt Reporting Web Layer
  • org.nuxeo.ecm.platform/nuxeo-birt-reporting-web/5.8.0-HF21-SNAPSHOT/nuxeo-birt-reporting-web-5.8.0-HF21-SNAPSHOT.jar
  • org.nuxeo.ecm.platform/nuxeo-birt-reporting-web/5.8.0-HF21-SNAPSHOT/nuxeo-birt-reporting-web-5.8.0-HF21-SNAPSHOT.pom

  • JUnit Tests
    Name: org.nuxeo.ecm.platform.reporting.tests Failed: 13 test(s), Passed: 0 test(s), Skipped: 0 test(s), Total: 13 test(s)
  • Failed: org.nuxeo.ecm.platform.reporting.tests.TestAdapters.testAdapters
  • Failed: org.nuxeo.ecm.platform.reporting.tests.TestAdapters.testParams
  • Failed: org.nuxeo.ecm.platform.reporting.tests.TestBirtDesign.testNuxeoReport
  • Failed: org.nuxeo.ecm.platform.reporting.tests.TestBirtDesign.testNuxeoReportWithParams
  • Failed: org.nuxeo.ecm.platform.reporting.tests.TestBirtPlatformDeploy.testDeploy
  • Failed: org.nuxeo.ecm.platform.reporting.tests.TestBirtPlatformDeploy.testGetReportParameters
  • Failed: org.nuxeo.ecm.platform.reporting.tests.TestBirtPlatformDeploy.testLoadReport
  • Failed: org.nuxeo.ecm.platform.reporting.tests.TestBirtPlatformDeploy.testReportHtmlRendering
  • Failed: org.nuxeo.ecm.platform.reporting.tests.TestBirtPlatformDeploy.testReportHtmlRenderingWithParams
  • Failed: org.nuxeo.ecm.platform.reporting.tests.TestBirtPlatformDeploy.testReportPDFRenderingWithParams
  • Failed: org.nuxeo.ecm.platform.reporting.tests.TestContextualParameters.contextualParametersShouldBeReplacedInsideWorkspace
  • Failed: org.nuxeo.ecm.platform.reporting.tests.TestContextualParameters.contextualParametersShouldNotBeReplacedOutsideWorkspace
  • Failed: org.nuxeo.ecm.platform.reporting.tests.TestContextualParameters.unknownParametersShouldNotBeReplaced

  • _______________________________________________
    ECM-QA mailing list
    ECM-QA@...
    http://lists.nuxeo.com/mailman/listinfo/ecm-qa
    
    Jenkins QA | 26 Aug 19:33 2014

    [QA] FT-nuxeo-master-cmis-dm-tomcat - Build # 167 - Unstable!

    BUILD UNSTABLE
    Build URL https://qa.nuxeo.org/jenkins/job/FT-nuxeo-master-cmis-dm-tomcat/167/
    Project: FT-nuxeo-master-cmis-dm-tomcat
    Date of build: Tue, 26 Aug 2014 19:30:49 +0200
    Build duration: 2 min 16 sec

    CHANGES
      Revision f07088be5a801eb85af8b23b572a852b5f1b2fb2 by slacoin:(NXP-15045 selenium tests should wait for gadgets on home page (commit: f07088be5a801eb85af8b23b572a852b5f1b2fb2))
      edit nuxeo-distribution-dm/ftest/selenium/tests/searchUsers.html
      edit nuxeo-distribution-dm/ftest/selenium/tests/deleteUser.html

    BUILD ARTIFACTS
  • nuxeo-distribution-dm/ftest/cmis/target/cmis.log
  • nuxeo-distribution-dm/ftest/cmis/target/nxtools-reports/nxtools-summary.xml
  • nuxeo-distribution-dm/ftest/cmis/target/tomcat/log/classloader.log
  • nuxeo-distribution-dm/ftest/cmis/target/tomcat/log/console.log
  • nuxeo-distribution-dm/ftest/cmis/target/tomcat/log/nuxeo-error.log
  • nuxeo-distribution-dm/ftest/cmis/target/tomcat/log/nuxeo.pid
  • nuxeo-distribution-dm/ftest/cmis/target/tomcat/log/nuxeoctl.log
  • nuxeo-distribution-dm/ftest/cmis/target/tomcat/log/server.log
  • nuxeo-distribution-dm/ftest/cmis/target/tomcat/log/stderr.log
  • nuxeo-distribution-dm/ftest/cmis/target/tomcat/log/tomcat.log
  • nuxeo-distribution-dm/ftest/cmis/target/tomcat/nxserver/config/distribution.properties
  • nuxeo-distribution-dm/ftest/cmis/target/tomcat/nxserver/data/installAfterRestart-DAM.log
  • nuxeo-distribution-dm/ftest/cmis/target/tomcat/nxserver/data/installAfterRestart-DM.log
  • nuxeo-distribution-dm/ftest/cmis/target/tomcat/nxserver/data/installAfterRestart-SC.log

  • _______________________________________________
    ECM-QA mailing list
    ECM-QA@...
    http://lists.nuxeo.com/mailman/listinfo/ecm-qa
    
    Jenkins QA | 26 Aug 17:14 2014

    [QA] nuxeo.io-master - Build # 214 - Failure!

    BUILD FAILURE
    Build URL https://qa.nuxeo.org/jenkins/job/nuxeo.io-master/214/
    Project: nuxeo.io-master
    Date of build: Tue, 26 Aug 2014 17:12:08 +0200
    Build duration: 2 min 17 sec

    CHANGES
      Revision bf8568fbfcc7c229bb0b625f1fdef75667ad6a30 by Thomas Roger:(NXIO-303: align on 5.9.5; use version 5.9.5.1 for nuxeo-platform-web-common and nuxeo-theme-jsf for https issue (commit: bf8568fbfcc7c229bb0b625f1fdef75667ad6a30))
      edit ansible/host_vars/sales-mgr.nuxeo.io
      edit ansible/host_vars/citest.nuxeo.io
      edit marketplace-nuxeo-io/marketplace/pom.xml
      edit pom.xml

    BUILD ARTIFACTS
    nuxeo.io module
  • org.nuxeo.io/nuxeo-io/0.3-SNAPSHOT/nuxeo-io-0.3-SNAPSHOT.pom
  • nuxeo.io etcd module
    HTML Frontend of nuxeo.io manager
  • org.nuxeo.io/nuxeo-io-front/0.3-SNAPSHOT/nuxeo-io-front-0.3-SNAPSHOT.pom
  • nuxeo.io Parent
  • org.nuxeo.io/nuxeo-io-parent/0.3-SNAPSHOT/nuxeo-io-parent-0.3-SNAPSHOT.pom
  • Marketplace package
    nuxeo.io Marketplace package

    CONSOLE OUTPUT
    [...truncated 2125 lines...]
    [INFO] Finished at: 2014-08-26T17:14:19+01:00
    [INFO] Final Memory: 78M/294M
    [INFO] ------------------------------------------------------------------------
    Waiting for Jenkins to finish collecting data
    [ERROR] Failed to execute goal org.apache.maven.plugins:maven-compiler-plugin:3.1:testCompile (default-testCompile) on project nuxeo-io: Compilation failure: Compilation failure:
    [ERROR] /home/hudson/tmp/workspace/nuxeo.io-master/nuxeo-io/src/test/java/org/nuxeo/io/test/rest/BaseRestTest.java:[32,33] cannot find symbol
    [ERROR] symbol: class RuntimeService
    [ERROR] location: package org.mockito.configuration
    [ERROR] /home/hudson/tmp/workspace/nuxeo.io-master/nuxeo-io/src/test/java/org/nuxeo/io/test/BaseTest.java:[30,33] cannot find symbol
    [ERROR] symbol: class RuntimeService
    [ERROR] location: package org.mockito.configuration
    [ERROR] /home/hudson/tmp/workspace/nuxeo.io-master/nuxeo-io/src/test/java/org/nuxeo/io/test/TestAdapters.java:[36,33] cannot find symbol
    [ERROR] symbol: class RuntimeService
    [ERROR] location: package org.mockito.configuration
    [ERROR] /home/hudson/tmp/workspace/nuxeo.io-master/nuxeo-io/src/test/java/org/nuxeo/io/test/TestDomainListener.java:[10,33] cannot find symbol
    [ERROR] symbol: class RuntimeService
    [ERROR] location: package org.mockito.configuration
    [ERROR] /home/hudson/tmp/workspace/nuxeo.io-master/nuxeo-io/src/test/java/org/nuxeo/io/test/TestEnvironmentStatus.java:[31,33] cannot find symbol
    [ERROR] symbol: class RuntimeService
    [ERROR] location: package org.mockito.configuration
    [ERROR] /home/hudson/tmp/workspace/nuxeo.io-master/nuxeo-io/src/test/java/org/nuxeo/io/test/TestEnvironmentListeners.java:[33,33] cannot find symbol
    [ERROR] symbol: class RuntimeService
    [ERROR] location: package org.mockito.configuration
    [ERROR] /home/hudson/tmp/workspace/nuxeo.io-master/nuxeo-io/src/test/java/org/nuxeo/io/test/TestContentTemplate.java:[34,33] cannot find symbol
    [ERROR] symbol: class RuntimeService
    [ERROR] location: package org.mockito.configuration
    [ERROR] /home/hudson/tmp/workspace/nuxeo.io-master/nuxeo-io/src/test/java/org/nuxeo/io/test/rest/BaseRestTest.java:[58,6] cannot find symbol
    [ERROR] symbol: class RuntimeService
    [ERROR] location: class org.nuxeo.io.test.rest.BaseRestTest
    [ERROR] /home/hudson/tmp/workspace/nuxeo.io-master/nuxeo-io/src/test/java/org/nuxeo/io/test/rest/BaseRestTest.java:[62,6] cannot find symbol
    [ERROR] symbol: class RuntimeService
    [ERROR] location: class org.nuxeo.io.test.rest.BaseRestTest
    [ERROR] /home/hudson/tmp/workspace/nuxeo.io-master/nuxeo-io/src/test/java/org/nuxeo/io/test/rest/BaseRestTest.java:[66,6] cannot find symbol
    [ERROR] symbol: class RuntimeService
    [ERROR] location: class org.nuxeo.io.test.rest.BaseRestTest
    [ERROR] /home/hudson/tmp/workspace/nuxeo.io-master/nuxeo-io/src/test/java/org/nuxeo/io/test/BaseTest.java:[50,6] cannot find symbol
    [ERROR] symbol: class RuntimeService
    [ERROR] location: class org.nuxeo.io.test.BaseTest
    [ERROR] /home/hudson/tmp/workspace/nuxeo.io-master/nuxeo-io/src/test/java/org/nuxeo/io/test/TestAdapters.java:[56,6] cannot find symbol
    [ERROR] symbol: class RuntimeService
    [ERROR] location: class org.nuxeo.io.test.TestAdapters
    [ERROR] /home/hudson/tmp/workspace/nuxeo.io-master/nuxeo-io/src/test/java/org/nuxeo/io/test/TestDomainListener.java:[27,6] cannot find symbol
    [ERROR] symbol: class RuntimeService
    [ERROR] location: class org.nuxeo.io.test.TestDomainListener
    [ERROR] /home/hudson/tmp/workspace/nuxeo.io-master/nuxeo-io/src/test/java/org/nuxeo/io/test/TestDomainListener.java:[31,6] cannot find symbol
    [ERROR] symbol: class RuntimeService
    [ERROR] location: class org.nuxeo.io.test.TestDomainListener
    [ERROR] /home/hudson/tmp/workspace/nuxeo.io-master/nuxeo-io/src/test/java/org/nuxeo/io/test/TestEnvironmentStatus.java:[52,6] cannot find symbol
    [ERROR] symbol: class RuntimeService
    [ERROR] location: class org.nuxeo.io.test.TestEnvironmentStatus
    [ERROR] /home/hudson/tmp/workspace/nuxeo.io-master/nuxeo-io/src/test/java/org/nuxeo/io/test/TestEnvironmentStatus.java:[56,6] cannot find symbol
    [ERROR] symbol: class RuntimeService
    [ERROR] location: class org.nuxeo.io.test.TestEnvironmentStatus
    [ERROR] /home/hudson/tmp/workspace/nuxeo.io-master/nuxeo-io/src/test/java/org/nuxeo/io/test/TestEnvironmentListeners.java:[52,6] cannot find symbol
    [ERROR] symbol: class RuntimeService
    [ERROR] location: class org.nuxeo.io.test.TestEnvironmentListeners
    [ERROR] /home/hudson/tmp/workspace/nuxeo.io-master/nuxeo-io/src/test/java/org/nuxeo/io/test/TestEnvironmentListeners.java:[56,6] cannot find symbol
    [ERROR] symbol: class RuntimeService
    [ERROR] location: class org.nuxeo.io.test.TestEnvironmentListeners
    [ERROR] /home/hudson/tmp/workspace/nuxeo.io-master/nuxeo-io/src/test/java/org/nuxeo/io/test/TestContentTemplate.java:[52,6] cannot find symbol
    [ERROR] symbol: class RuntimeService
    [ERROR] location: class org.nuxeo.io.test.TestContentTemplate
    [ERROR] -> [Help 1]
    [ERROR]
    [ERROR] To see the full stack trace of the errors, re-run Maven with the -e switch.
    [ERROR] Re-run Maven using the -X switch to enable full debug logging.
    [ERROR]
    [ERROR] For more information about the errors and possible solutions, please read the following articles:
    [ERROR] [Help 1] http://cwiki.apache.org/confluence/display/MAVEN/MojoFailureException
    [ERROR]
    [ERROR] After correcting the problems, you can resume the build with the command
    [ERROR] mvn -rf :nuxeo-io
    [JENKINS] Archiving /home/hudson/tmp/workspace/nuxeo.io-master/nuxeo-io-front/pom.xml to org.nuxeo.io/nuxeo-io-front/0.3-SNAPSHOT/nuxeo-io-front-0.3-SNAPSHOT.pom
    Sending artifact delta relative to nuxeo.io-master » HTML Frontend of nuxeo.io manager #213
    Archived 1 artifacts
    Archive block size is 32768
    Received 0 blocks and 1335 bytes
    Compression is 0.0%
    Took 1.8 sec
    [JENKINS] Archiving /home/hudson/tmp/workspace/nuxeo.io-master/pom.xml to org.nuxeo.io/nuxeo-io-parent/0.3-SNAPSHOT/nuxeo-io-parent-0.3-SNAPSHOT.pom
    Sending artifact delta relative to nuxeo.io-master » nuxeo.io Parent #213
    Archived 1 artifacts
    Archive block size is 32768
    Received 0 blocks and 5098 bytes
    Compression is 0.0%
    Took 14 ms
    [JENKINS] Archiving /home/hudson/tmp/workspace/nuxeo.io-master/nuxeo-io/pom.xml to org.nuxeo.io/nuxeo-io/0.3-SNAPSHOT/nuxeo-io-0.3-SNAPSHOT.pom
    Sending artifact delta relative to nuxeo.io-master » nuxeo.io module #213
    Archived 1 artifacts
    Archive block size is 32768
    Received 0 blocks and 4032 bytes
    Compression is 0.0%
    Took 11 ms
    channel stopped
    Updating NXIO-303
    Email was triggered for: Failure - 1st
    Trigger Failure - Any was overridden by another trigger and will not send an email.
    Trigger Failure - Still was overridden by another trigger and will not send an email.
    Sending email for trigger: Failure - 1st

    _______________________________________________
    ECM-QA mailing list
    ECM-QA@...
    http://lists.nuxeo.com/mailman/listinfo/ecm-qa
    
    Jenkins QA | 26 Aug 11:02 2014

    [QA] FT-nuxeo-master-cmis-dm-tomcat - Build # 166 - Successful!

    BUILD SUCCESS
    Build URL https://qa.nuxeo.org/jenkins/job/FT-nuxeo-master-cmis-dm-tomcat/166/
    Project: FT-nuxeo-master-cmis-dm-tomcat
    Date of build: Tue, 26 Aug 2014 10:54:25 +0200
    Build duration: 8 min 21 sec

    CHANGES
      Revision 9b9704dc92bedff7018d49c6088aa736dea4cfa1 by slacoin:(NXP-14728 activate managed datasource mode by default in tomcat (revert wrong commit) (commit: 9b9704dc92bedff7018d49c6088aa736dea4cfa1))
      edit nuxeo-distribution-resources/src/main/resources/templates-tomcat/common-base/conf/server.xml.nxftl
      edit nuxeo-distribution-resources/src/main/resources/templates-tomcat/common-base/nxserver/config/default-repository-config.xml.nxftl
      edit nuxeo-distribution-resources/src/main/resources/templates-tomcat/common-base/nuxeo.defaults
      edit nuxeo-distribution-resources/src/main/resources/templates-tomcat/common-base/nxserver/config/datasources-config.xml.nxftl
      edit nuxeo-distribution-resources/src/main/resources/templates-tomcat/common-base/conf/Catalina/localhost/nuxeo.xml.nxftl

    BUILD ARTIFACTS
  • nuxeo-distribution-dm/ftest/cmis/target/cmis.log
  • nuxeo-distribution-dm/ftest/cmis/target/nxtools-reports/nxtools-summary.xml
  • nuxeo-distribution-dm/ftest/cmis/target/tomcat/log/classloader.log
  • nuxeo-distribution-dm/ftest/cmis/target/tomcat/log/console.log
  • nuxeo-distribution-dm/ftest/cmis/target/tomcat/log/nuxeo-error.log
  • nuxeo-distribution-dm/ftest/cmis/target/tomcat/log/nuxeo.pid
  • nuxeo-distribution-dm/ftest/cmis/target/tomcat/log/nuxeoctl.log
  • nuxeo-distribution-dm/ftest/cmis/target/tomcat/log/server.log
  • nuxeo-distribution-dm/ftest/cmis/target/tomcat/log/stderr.log
  • nuxeo-distribution-dm/ftest/cmis/target/tomcat/log/tomcat.log
  • nuxeo-distribution-dm/ftest/cmis/target/tomcat/nxserver/config/distribution.properties
  • nuxeo-distribution-dm/ftest/cmis/target/tomcat/nxserver/data/installAfterRestart-DAM.log
  • nuxeo-distribution-dm/ftest/cmis/target/tomcat/nxserver/data/installAfterRestart-DM.log
  • nuxeo-distribution-dm/ftest/cmis/target/tomcat/nxserver/data/installAfterRestart-SC.log

  • _______________________________________________
    ECM-QA mailing list
    ECM-QA@...
    http://lists.nuxeo.com/mailman/listinfo/ecm-qa
    
    Jenkins QA | 26 Aug 10:19 2014

    Build failed in Jenkins: FT-nuxeo-master-webdriver-dam-tomcat_permanentCheck #4409

    See <https://qa.nuxeo.org/jenkins/job/FT-nuxeo-master-webdriver-dam-tomcat_permanentCheck/4409/>
    
    ------------------------------------------
    [...truncated 1355 lines...]
    [INFO] Downloaded:
    http://maven.in.nuxeo.com/nexus/content/groups/internal-snapshots/org/nuxeo/marketplace/dam/marketplace-dam/5.9.6-SNAPSHOT/maven-metadata.xml
    (2 KB at 8.0 KB/sec)
    [INFO]      [copy] Copying 1 file to <https://qa.nuxeo.org/jenkins/job/FT-nuxeo-master-webdriver-dam-tomcat_permanentCheck/ws/nuxeo/nuxeo-distribution/nuxeo-marketplace-dam/ftest/webdriver/target>
    
    nuxeo-asset-browser-tests.stop-unix:
    [INFO]      [exec] Detected Tomcat server.
    [INFO]      [exec] Nuxeo home:          <https://qa.nuxeo.org/jenkins/job/FT-nuxeo-master-webdriver-dam-tomcat_permanentCheck/ws/tomcat-selenium>
    [INFO]      [exec] Nuxeo configuration: <https://qa.nuxeo.org/jenkins/job/FT-nuxeo-master-webdriver-dam-tomcat_permanentCheck/ws/tomcat-selenium/bin/nuxeo.conf>
    [INFO]      [exec] Include template: <https://qa.nuxeo.org/jenkins/job/FT-nuxeo-master-webdriver-dam-tomcat_permanentCheck/ws/tomcat-selenium/templates/common-base>
    [INFO]      [exec] Include template: <https://qa.nuxeo.org/jenkins/job/FT-nuxeo-master-webdriver-dam-tomcat_permanentCheck/ws/tomcat-selenium/templates/common>
    [INFO]      [exec] Include template: <https://qa.nuxeo.org/jenkins/job/FT-nuxeo-master-webdriver-dam-tomcat_permanentCheck/ws/tomcat-selenium/templates/default>
    [INFO]      [exec] Server is not running.
    
    nuxeo-asset-browser-tests.start-unix:
    [INFO]      [exec] Detected Tomcat server.
    [INFO]      [exec] Nuxeo home:          <https://qa.nuxeo.org/jenkins/job/FT-nuxeo-master-webdriver-dam-tomcat_permanentCheck/ws/tomcat-selenium>
    [INFO]      [exec] Nuxeo configuration: <https://qa.nuxeo.org/jenkins/job/FT-nuxeo-master-webdriver-dam-tomcat_permanentCheck/ws/tomcat-selenium/bin/nuxeo.conf>
    [INFO]      [exec] Include template: <https://qa.nuxeo.org/jenkins/job/FT-nuxeo-master-webdriver-dam-tomcat_permanentCheck/ws/tomcat-selenium/templates/common-base>
    [INFO]      [exec] Include template: <https://qa.nuxeo.org/jenkins/job/FT-nuxeo-master-webdriver-dam-tomcat_permanentCheck/ws/tomcat-selenium/templates/common>
    [INFO]      [exec] Include template: <https://qa.nuxeo.org/jenkins/job/FT-nuxeo-master-webdriver-dam-tomcat_permanentCheck/ws/tomcat-selenium/templates/default>
    [INFO]      [exec] No current configuration, generating files...
    [INFO]      [exec] Configuration files generated.
    [INFO]      [exec] Added <https://qa.nuxeo.org/jenkins/job/FT-nuxeo-master-webdriver-dam-tomcat_permanentCheck/ws/tomcat-selenium/setupWizardDownloads/02eef32e596e07c757228dafc721b664>
    [INFO]      [exec] Added <https://qa.nuxeo.org/jenkins/job/FT-nuxeo-master-webdriver-dam-tomcat_permanentCheck/ws/tomcat-selenium/setupWizardDownloads/612404d12a5015d7d47ca877b589ec36>
    [INFO]      [exec] Added <https://qa.nuxeo.org/jenkins/job/FT-nuxeo-master-webdriver-dam-tomcat_permanentCheck/ws/tomcat-selenium/setupWizardDownloads/aa6f9a0f1dd62d911840a40d78a4726b>
    [INFO]      [exec] Replacement of nuxeo-dam-5.9.6-SNAPSHOT in local cache...
    [INFO]      [exec] Added <https://qa.nuxeo.org/jenkins/job/FT-nuxeo-master-webdriver-dam-tomcat_permanentCheck/ws/nuxeo/nuxeo-distribution/nuxeo-marketplace-dam/ftest/webdriver/target/marketplace-dam-5.9.6-SNAPSHOT.zip>
    [INFO]      [exec] Dependency resolution:
    [INFO]      [exec]   Installation order (2):        nuxeo-dm-5.9.6-SNAPSHOT/nuxeo-dam-5.9.6-SNAPSHOT
    [INFO]      [exec]   Local packages to install (2): nuxeo-dm:5.9.6-SNAPSHOT, nuxeo-dam:5.9.6-SNAPSHOT
    [INFO]      [exec] Installing nuxeo-dm-5.9.6-SNAPSHOT
    [INFO]      [exec] Installing nuxeo-dam-5.9.6-SNAPSHOT
    [INFO]      [exec] Detected Tomcat server.
    [INFO]      [exec] Detected Tomcat server.
    [INFO]      [exec] Nuxeo home:          <https://qa.nuxeo.org/jenkins/job/FT-nuxeo-master-webdriver-dam-tomcat_permanentCheck/ws/tomcat-selenium>
    [INFO]      [exec] Nuxeo configuration: <https://qa.nuxeo.org/jenkins/job/FT-nuxeo-master-webdriver-dam-tomcat_permanentCheck/ws/tomcat-selenium/bin/nuxeo.conf>
    [INFO]      [exec] Include template: <https://qa.nuxeo.org/jenkins/job/FT-nuxeo-master-webdriver-dam-tomcat_permanentCheck/ws/tomcat-selenium/templates/common-base>
    [INFO]      [exec] Include template: <https://qa.nuxeo.org/jenkins/job/FT-nuxeo-master-webdriver-dam-tomcat_permanentCheck/ws/tomcat-selenium/templates/common>
    [INFO]      [exec] Include template: <https://qa.nuxeo.org/jenkins/job/FT-nuxeo-master-webdriver-dam-tomcat_permanentCheck/ws/tomcat-selenium/templates/default>
    [INFO]      [exec] Include template: <https://qa.nuxeo.org/jenkins/job/FT-nuxeo-master-webdriver-dam-tomcat_permanentCheck/ws/tomcat-selenium/templates/dam>
    [INFO]      [exec] Configuration files generation (nuxeo.force.generation=true)...
    [INFO]      [exec] Configuration files generated.
    [INFO]      [exec] Server started with process ID 4242.
    [INFO]      [exec] ..........
    [INFO]      [exec] ======================================================================
    [INFO]      [exec] = Component Loading Status: Pending: 0 / Unstarted: 0 / Total: 655
    [INFO]      [exec] ======================================================================
    [INFO]      [exec] Started in 0min20s
    [INFO]      [exec] Go to http://localhost:8080/nuxeo
    [INFO] 
    [INFO] --- maven-failsafe-plugin:2.17:integration-test (default)  <at> 
    nuxeo-distribution-dam-webdriver-tests ---
    [INFO] Failsafe report directory: <https://qa.nuxeo.org/jenkins/job/FT-nuxeo-master-webdriver-dam-tomcat_permanentCheck/ws/nuxeo/nuxeo-distribution/nuxeo-marketplace-dam/ftest/webdriver/target/failsafe-reports>
    
    -------------------------------------------------------
     T E S T S
    -------------------------------------------------------
    Running com.nuxeo.functionaltests.ITAssetViewTest
    10:15:31,385 INFO  [AbstractTest] Starting test 'com.nuxeo.functionaltests.ITAssetViewTest#testMetadataEdition'
    10:16:18,581 INFO  [AbstractTest] Finished test 'com.nuxeo.functionaltests.ITAssetViewTest#testMetadataEdition'
    10:16:18,581 INFO  [AbstractTest] Starting test 'com.nuxeo.functionaltests.ITAssetViewTest#testIntellectualProperty'
    10:16:30,971 INFO  [AbstractTest] Finished test 'com.nuxeo.functionaltests.ITAssetViewTest#testIntellectualProperty'
    10:16:30,972 INFO  [AbstractTest] Starting test 'com.nuxeo.functionaltests.ITAssetViewTest#testAssetSelection'
    10:16:48,790 INFO  [AbstractTest] Finished test 'com.nuxeo.functionaltests.ITAssetViewTest#testAssetSelection'
    Tests run: 3, Failures: 0, Errors: 0, Skipped: 0, Time elapsed: 83.41 sec - in com.nuxeo.functionaltests.ITAssetViewTest
    Running com.nuxeo.functionaltests.ITBulkEditTest
    10:16:53,199 INFO  [AbstractTest] Starting test 'com.nuxeo.functionaltests.ITBulkEditTest#testBulkEdit'
    10:17:26,063 INFO  [AbstractTest] Finished test 'com.nuxeo.functionaltests.ITBulkEditTest#testBulkEdit'
    Tests run: 1, Failures: 0, Errors: 0, Skipped: 0, Time elapsed: 37.219 sec - in com.nuxeo.functionaltests.ITBulkEditTest
    Running com.nuxeo.functionaltests.ITAssetCreationTest
    10:17:30,182 INFO  [AbstractTest] Starting test 'com.nuxeo.functionaltests.ITAssetCreationTest#testFileCreation'
    10:17:43,747 INFO  [AbstractTest] Finished test 'com.nuxeo.functionaltests.ITAssetCreationTest#testFileCreation'
    Tests run: 1, Failures: 0, Errors: 0, Skipped: 0, Time elapsed: 17.683 sec - in com.nuxeo.functionaltests.ITAssetCreationTest
    Running com.nuxeo.functionaltests.ITSearchFormTest
    10:17:47,177 INFO  [AbstractTest] Starting test 'com.nuxeo.functionaltests.ITSearchFormTest#testSelectedContentView'
    10:17:56,788 INFO  [AbstractTest] Finished test 'com.nuxeo.functionaltests.ITSearchFormTest#testSelectedContentView'
    10:17:56,789 INFO  [AbstractTest] Starting test 'com.nuxeo.functionaltests.ITSearchFormTest#testTextSearch'
    10:18:21,650 INFO  [AbstractTest] Finished test 'com.nuxeo.functionaltests.ITSearchFormTest#testTextSearch'
    10:18:21,651 INFO  [AbstractTest] Starting test 'com.nuxeo.functionaltests.ITSearchFormTest#testMultipleCriteriaSearch'
    10:18:45,811 INFO  [AbstractTest] Finished test 'com.nuxeo.functionaltests.ITSearchFormTest#testMultipleCriteriaSearch'
    Tests run: 3, Failures: 0, Errors: 0, Skipped: 0, Time elapsed: 62.113 sec - in com.nuxeo.functionaltests.ITSearchFormTest
    Running com.nuxeo.functionaltests.ITReadOnlyUserTest
    10:18:49,304 INFO  [AbstractTest] Starting test 'com.nuxeo.functionaltests.ITReadOnlyUserTest#testReadOnlyUser'
    10:19:11,842 INFO  [AbstractTest] Finished test 'com.nuxeo.functionaltests.ITReadOnlyUserTest#testReadOnlyUser'
    Tests run: 1, Failures: 0, Errors: 0, Skipped: 0, Time elapsed: 25.971 sec - in com.nuxeo.functionaltests.ITReadOnlyUserTest
    Running com.nuxeo.functionaltests.ITAssetPageTest
    10:19:15,985 INFO  [AbstractTest] Starting test 'com.nuxeo.functionaltests.ITAssetPageTest#navigateToDM'
    10:19:34,388 INFO  [AbstractTest] Finished test 'com.nuxeo.functionaltests.ITAssetPageTest#navigateToDM'
    10:19:34,389 INFO  [AbstractTest] Starting test 'com.nuxeo.functionaltests.ITAssetPageTest#testAssetPage'
    10:19:45,683 ERROR [AbstractTest] Test
    'com.nuxeo.functionaltests.ITAssetPageTest#testAssetPage' failed
    org.openqa.selenium.NoSuchElementException: Unable to locate element: {"method":"class name","selector":"documentTitle"}
    Command duration or timeout: 284 milliseconds
    For documentation on this error, please visit: http://seleniumhq.org/exceptions/no_such_element.html
    Build info: version: '2.39.0', revision: 'ff23eac', time: '2013-12-16 16:11:15'
    System info: host: 'joyeux', ip: '10.213.0.35', os.name: 'Linux', os.arch: 'amd64', os.version:
    '3.13.0-32-generic', java.version: '1.7.0_09'
    Session ID: e489b76b-0694-4238-9a89-ab319d483ab6
    Driver info: org.openqa.selenium.firefox.FirefoxDriver
    Capabilities [{platform=LINUX, acceptSslCerts=true, javascriptEnabled=true,
    cssSelectorsEnabled=true, databaseEnabled=true, browserName=firefox, handlesAlerts=true,
    browserConnectionEnabled=true, webStorageEnabled=true, nativeEvents=false, rotatable=false,
    locationContextEnabled=true, applicationCacheEnabled=true, takesScreenshot=true, version=26.0}]
    	at sun.reflect.GeneratedConstructorAccessor11.newInstance(Unknown Source)
    	at sun.reflect.DelegatingConstructorAccessorImpl.newInstance(DelegatingConstructorAccessorImpl.java:45)
    	at java.lang.reflect.Constructor.newInstance(Constructor.java:525)
    	at org.openqa.selenium.remote.ErrorHandler.createThrowable(ErrorHandler.java:193)
    	at org.openqa.selenium.remote.ErrorHandler.throwIfResponseFailed(ErrorHandler.java:145)
    	at org.openqa.selenium.remote.RemoteWebDriver.execute(RemoteWebDriver.java:554)
    	at org.openqa.selenium.remote.RemoteWebDriver.findElement(RemoteWebDriver.java:307)
    	at org.openqa.selenium.remote.RemoteWebDriver.findElementByClassName(RemoteWebDriver.java:388)
    	at org.openqa.selenium.By$ByClassName.findElement(By.java:393)
    	at org.openqa.selenium.remote.RemoteWebDriver.findElement(RemoteWebDriver.java:299)
    	at org.nuxeo.functionaltests.dam.DAMAssetPage.getAssetTitle(DAMAssetPage.java:37)
    	at org.nuxeo.functionaltests.dam.DAMAssetPage.checkAssetTitle(DAMAssetPage.java:41)
    	at com.nuxeo.functionaltests.ITAssetPageTest.testAssetPage(ITAssetPageTest.java:82)
    	at sun.reflect.NativeMethodAccessorImpl.invoke0(Native Method)
    	at sun.reflect.NativeMethodAccessorImpl.invoke(NativeMethodAccessorImpl.java:57)
    	at sun.reflect.DelegatingMethodAccessorImpl.invoke(DelegatingMethodAccessorImpl.java:43)
    	at java.lang.reflect.Method.invoke(Method.java:601)
    	at org.junit.runners.model.FrameworkMethod$1.runReflectiveCall(FrameworkMethod.java:44)
    	at org.junit.internal.runners.model.ReflectiveCallable.run(ReflectiveCallable.java:15)
    	at org.junit.runners.model.FrameworkMethod.invokeExplosively(FrameworkMethod.java:41)
    	at org.junit.internal.runners.statements.InvokeMethod.evaluate(InvokeMethod.java:20)
    	at org.junit.internal.runners.statements.RunBefores.evaluate(RunBefores.java:28)
    	at org.junit.internal.runners.statements.RunAfters.evaluate(RunAfters.java:31)
    	at org.nuxeo.functionaltests.LogTestWatchman$1.evaluate(LogTestWatchman.java:96)
    	at org.junit.runners.BlockJUnit4ClassRunner.runChild(BlockJUnit4ClassRunner.java:76)
    	at org.junit.runners.BlockJUnit4ClassRunner.runChild(BlockJUnit4ClassRunner.java:50)
    	at org.junit.runners.ParentRunner$3.run(ParentRunner.java:193)
    	at org.junit.runners.ParentRunner$1.schedule(ParentRunner.java:52)
    	at org.junit.runners.ParentRunner.runChildren(ParentRunner.java:191)
    	at org.junit.runners.ParentRunner.access$000(ParentRunner.java:42)
    	at org.junit.runners.ParentRunner$2.evaluate(ParentRunner.java:184)
    	at org.junit.internal.runners.statements.RunBefores.evaluate(RunBefores.java:28)
    	at org.junit.internal.runners.statements.RunAfters.evaluate(RunAfters.java:31)
    	at org.junit.runners.ParentRunner.run(ParentRunner.java:236)
    	at org.apache.maven.surefire.junit4.JUnit4Provider.execute(JUnit4Provider.java:264)
    	at org.apache.maven.surefire.junit4.JUnit4Provider.executeTestSet(JUnit4Provider.java:153)
    	at org.apache.maven.surefire.junit4.JUnit4Provider.invoke(JUnit4Provider.java:124)
    	at org.apache.maven.surefire.booter.ForkedBooter.invokeProviderInSameClassLoader(ForkedBooter.java:200)
    	at org.apache.maven.surefire.booter.ForkedBooter.runSuitesInProcess(ForkedBooter.java:153)
    	at org.apache.maven.surefire.booter.ForkedBooter.main(ForkedBooter.java:103)
    Caused by: org.openqa.selenium.remote.ErrorHandler$UnknownServerException: Unable to locate
    element: {"method":"class name","selector":"documentTitle"}
    Build info: version: '2.39.0', revision: 'ff23eac', time: '2013-12-16 16:11:15'
    System info: host: 'joyeux', ip: '10.213.0.35', os.name: 'Linux', os.arch: 'amd64', os.version:
    '3.13.0-32-generic', java.version: '1.7.0_09'
    Driver info: driver.version: unknown
    	at <anonymous class>.FirefoxDriver.prototype.findElementInternal_(file:///tmp/anonymous4242502642370197160webdriver-profile/extensions/fxdriver <at> googlecode.com/components/driver_component.js:8860)
    	at <anonymous class>.FirefoxDriver.prototype.findElement(file:///tmp/anonymous4242502642370197160webdriver-profile/extensions/fxdriver <at> googlecode.com/components/driver_component.js:8869)
    	at <anonymous class>.DelayedCommand.prototype.executeInternal_/h(file:///tmp/anonymous4242502642370197160webdriver-profile/extensions/fxdriver <at> googlecode.com/components/command_processor.js:10831)
    	at <anonymous class>.DelayedCommand.prototype.executeInternal_(file:///tmp/anonymous4242502642370197160webdriver-profile/extensions/fxdriver <at> googlecode.com/components/command_processor.js:10836)
    	at <anonymous class>.DelayedCommand.prototype.execute/<(file:///tmp/anonymous4242502642370197160webdriver-profile/extensions/fxdriver <at> googlecode.com/components/command_processor.js:10778)
    10:19:45,686 INFO  [AbstractTest] Created screenshot file named '<https://qa.nuxeo.org/jenkins/job/FT-nuxeo-master-webdriver-dam-tomcat_permanentCheck/ws/nuxeo/nuxeo-distribution/nuxeo-marketplace-dam/ftest/webdriver/target/screenshot-lastpage-com.nuxeo.functionaltests.ITAssetPageTest-testAssetPage8605647057559566894.png'>
    10:19:45,686 INFO  [AbstractTest] Created page source file named '<https://qa.nuxeo.org/jenkins/job/FT-nuxeo-master-webdriver-dam-tomcat_permanentCheck/ws/nuxeo/nuxeo-distribution/nuxeo-marketplace-dam/ftest/webdriver/target/screenshot-lastpage-com.nuxeo.functionaltests.ITAssetPageTest-testAssetPage5251675142570556989.html'>
    10:19:45,686 INFO  [AbstractTest] Finished test 'com.nuxeo.functionaltests.ITAssetPageTest#testAssetPage'
    Tests run: 2, Failures: 0, Errors: 1, Skipped: 0, Time elapsed: 34.016 sec <<< FAILURE! - in com.nuxeo.functionaltests.ITAssetPageTest
    testAssetPage(com.nuxeo.functionaltests.ITAssetPageTest)  Time elapsed: 11.319 sec  <<< ERROR!
    org.openqa.selenium.NoSuchElementException: Unable to locate element: {"method":"class name","selector":"documentTitle"}
    Command duration or timeout: 284 milliseconds
    For documentation on this error, please visit: http://seleniumhq.org/exceptions/no_such_element.html
    Build info: version: '2.39.0', revision: 'ff23eac', time: '2013-12-16 16:11:15'
    System info: host: 'joyeux', ip: '10.213.0.35', os.name: 'Linux', os.arch: 'amd64', os.version:
    '3.13.0-32-generic', java.version: '1.7.0_09'
    Session ID: e489b76b-0694-4238-9a89-ab319d483ab6
    Driver info: org.openqa.selenium.firefox.FirefoxDriver
    Capabilities [{platform=LINUX, acceptSslCerts=true, javascriptEnabled=true,
    cssSelectorsEnabled=true, databaseEnabled=true, browserName=firefox, handlesAlerts=true,
    browserConnectionEnabled=true, webStorageEnabled=true, nativeEvents=false, rotatable=false,
    locationContextEnabled=true, applicationCacheEnabled=true, takesScreenshot=true, version=26.0}]
    	at sun.reflect.GeneratedConstructorAccessor11.newInstance(Unknown Source)
    	at sun.reflect.DelegatingConstructorAccessorImpl.newInstance(DelegatingConstructorAccessorImpl.java:45)
    	at java.lang.reflect.Constructor.newInstance(Constructor.java:525)
    	at org.openqa.selenium.remote.ErrorHandler.createThrowable(ErrorHandler.java:193)
    	at org.openqa.selenium.remote.ErrorHandler.throwIfResponseFailed(ErrorHandler.java:145)
    	at org.openqa.selenium.remote.RemoteWebDriver.execute(RemoteWebDriver.java:554)
    	at org.openqa.selenium.remote.RemoteWebDriver.findElement(RemoteWebDriver.java:307)
    	at org.openqa.selenium.remote.RemoteWebDriver.findElementByClassName(RemoteWebDriver.java:388)
    	at org.openqa.selenium.By$ByClassName.findElement(By.java:393)
    	at org.openqa.selenium.remote.RemoteWebDriver.findElement(RemoteWebDriver.java:299)
    	at org.nuxeo.functionaltests.dam.DAMAssetPage.getAssetTitle(DAMAssetPage.java:37)
    	at org.nuxeo.functionaltests.dam.DAMAssetPage.checkAssetTitle(DAMAssetPage.java:41)
    	at com.nuxeo.functionaltests.ITAssetPageTest.testAssetPage(ITAssetPageTest.java:82)
    Caused by: org.openqa.selenium.remote.ErrorHandler$UnknownServerException: Unable to locate
    element: {"method":"class name","selector":"documentTitle"}
    Build info: version: '2.39.0', revision: 'ff23eac', time: '2013-12-16 16:11:15'
    System info: host: 'joyeux', ip: '10.213.0.35', os.name: 'Linux', os.arch: 'amd64', os.version:
    '3.13.0-32-generic', java.version: '1.7.0_09'
    Driver info: driver.version: unknown
    	at <anonymous class>.FirefoxDriver.prototype.findElementInternal_(file:///tmp/anonymous4242502642370197160webdriver-profile/extensions/fxdriver <at> googlecode.com/components/driver_component.js:8860)
    	at <anonymous class>.FirefoxDriver.prototype.findElement(file:///tmp/anonymous4242502642370197160webdriver-profile/extensions/fxdriver <at> googlecode.com/components/driver_component.js:8869)
    	at <anonymous class>.DelayedCommand.prototype.executeInternal_/h(file:///tmp/anonymous4242502642370197160webdriver-profile/extensions/fxdriver <at> googlecode.com/components/command_processor.js:10831)
    	at <anonymous class>.DelayedCommand.prototype.executeInternal_(file:///tmp/anonymous4242502642370197160webdriver-profile/extensions/fxdriver <at> googlecode.com/components/command_processor.js:10836)
    	at <anonymous class>.DelayedCommand.prototype.execute/<(file:///tmp/anonymous4242502642370197160webdriver-profile/extensions/fxdriver <at> googlecode.com/components/command_processor.js:10778)
    
    Results :
    
    Tests in error: 
      ITAssetPageTest.testAssetPage:82 ยป NoSuchElement Unable to locate element: {"m...
    
    Tests run: 11, Failures: 0, Errors: 1, Skipped: 0
    
    [INFO] 
    [INFO] --- ant-assembly-maven-plugin:2.0.2:build (stop-tomcat)  <at> 
    nuxeo-distribution-dam-webdriver-tests ---
    Activating profile: tomcat
    Activating profile: NXP
    Activating profile: qa
    [INFO] Managed version set on org.nuxeo:nuxeo-ftest:zip:1.7.15
    [INFO]     [unzip] Expanding:
    /home/hudson/.m2/repository/org/nuxeo/nuxeo-ftest/1.7.15/nuxeo-ftest-1.7.15.zip into <https://qa.nuxeo.org/jenkins/job/FT-nuxeo-master-webdriver-dam-tomcat_permanentCheck/ws/nuxeo/nuxeo-distribution/nuxeo-marketplace-dam/ftest/webdriver/target>
    
    nuxeo-asset-browser-tests.stop-unix:
    [INFO]      [exec] Detected Tomcat server.
    [INFO]      [exec] Nuxeo home:          <https://qa.nuxeo.org/jenkins/job/FT-nuxeo-master-webdriver-dam-tomcat_permanentCheck/ws/tomcat-selenium>
    [INFO]      [exec] Nuxeo configuration: <https://qa.nuxeo.org/jenkins/job/FT-nuxeo-master-webdriver-dam-tomcat_permanentCheck/ws/tomcat-selenium/bin/nuxeo.conf>
    [INFO]      [exec] Include template: <https://qa.nuxeo.org/jenkins/job/FT-nuxeo-master-webdriver-dam-tomcat_permanentCheck/ws/tomcat-selenium/templates/common-base>
    [INFO]      [exec] Include template: <https://qa.nuxeo.org/jenkins/job/FT-nuxeo-master-webdriver-dam-tomcat_permanentCheck/ws/tomcat-selenium/templates/common>
    [INFO]      [exec] Include template: <https://qa.nuxeo.org/jenkins/job/FT-nuxeo-master-webdriver-dam-tomcat_permanentCheck/ws/tomcat-selenium/templates/default>
    [INFO]      [exec] Include template: <https://qa.nuxeo.org/jenkins/job/FT-nuxeo-master-webdriver-dam-tomcat_permanentCheck/ws/tomcat-selenium/templates/dam>
    [INFO]      [exec] Stopping server....Server stopped.
    [INFO] 
    [INFO] --- maven-failsafe-plugin:2.17:verify (default)  <at>  nuxeo-distribution-dam-webdriver-tests ---
    [INFO] Failsafe report directory: <https://qa.nuxeo.org/jenkins/job/FT-nuxeo-master-webdriver-dam-tomcat_permanentCheck/ws/nuxeo/nuxeo-distribution/nuxeo-marketplace-dam/ftest/webdriver/target/failsafe-reports>
    [INFO] ------------------------------------------------------------------------
    [INFO] Reactor Summary:
    [INFO] 
    [INFO] Nuxeo Functional Tests ............................ SUCCESS [  3.937 s]
    [INFO] Nuxeo Distribution Parent ......................... SUCCESS [  0.027 s]
    [INFO] Nuxeo DAM Functional Tests ........................ SUCCESS [  0.304 s]
    [INFO] Nuxeo Startup Wizard .............................. SUCCESS [  3.084 s]
    [INFO] Nuxeo multi-OS startup ............................ SUCCESS [  8.700 s]
    [INFO] Nuxeo Distribution Resources ...................... SUCCESS [  1.952 s]
    [INFO] Helper POM with Nuxeo test dependencies ........... SUCCESS [ 24.952 s]
    [INFO] Nuxeo DAM functional tests with WebDriver ......... FAILURE [04:55 min]
    [INFO] ------------------------------------------------------------------------
    [INFO] BUILD FAILURE
    [INFO] ------------------------------------------------------------------------
    [INFO] Total time: 05:39 min
    [INFO] Finished at: 2014-08-26T10:19:48+01:00
    [INFO] Final Memory: 103M/566M
    [INFO] ------------------------------------------------------------------------
    [ERROR] Failed to execute goal org.apache.maven.plugins:maven-failsafe-plugin:2.17:verify
    (default) on project nuxeo-distribution-dam-webdriver-tests: There are test failures.
    [ERROR] 
    [ERROR] Please refer to
    <https://qa.nuxeo.org/jenkins/job/FT-nuxeo-master-webdriver-dam-tomcat_permanentCheck/ws/nuxeo/nuxeo-distribution/nuxeo-marketplace-dam/ftest/webdriver/target/failsafe-reports>
    for the individual test results.
    [ERROR] -> [Help 1]
    [ERROR] 
    [ERROR] To see the full stack trace of the errors, re-run Maven with the -e switch.
    [ERROR] Re-run Maven using the -X switch to enable full debug logging.
    [ERROR] 
    [ERROR] For more information about the errors and possible solutions, please read the following articles:
    [ERROR] [Help 1] http://cwiki.apache.org/confluence/display/MAVEN/MojoFailureException
    [ERROR] 
    [ERROR] After correcting the problems, you can resume the build with the command
    [ERROR]   mvn <goals> -rf :nuxeo-distribution-dam-webdriver-tests
    Build step 'Invoke top-level Maven targets' marked build as failure
    Archiving artifacts
    Sending artifact delta relative to FT-nuxeo-master-webdriver-dam-tomcat_permanentCheck #4408
    Archived 18 artifacts
    Archive block size is 32768
    Received 0 blocks and 262188 bytes
    Compression is 0.0%
    Took 68 ms
    Recording test results
    _______________________________________________
    ECM-QA mailing list
    ECM-QA <at> lists.nuxeo.com
    http://lists.nuxeo.com/mailman/listinfo/ecm-qa
    
    Jenkins QA | 26 Aug 04:34 2014

    [QA] IT-nuxeo-master-build-debian - Build # 626 - Successful!

    BUILD SUCCESS
    Build URL https://qa.nuxeo.org/jenkins/job/IT-nuxeo-master-build-debian/626/
    Project: IT-nuxeo-master-build-debian
    Date of build: Tue, 26 Aug 2014 04:27:46 +0200
    Build duration: 6 min 48 sec

    CHANGES
    No Changes

    BUILD ARTIFACTS
  • target/packages/snapshots/nuxeo_5.9.6-00+20140826+01_all.deb
  • target/packages/src/nuxeo_5.9.6-00+20140826+01.diff.gz
  • target/packages/src/nuxeo_5.9.6-00+20140826+01.dsc
  • target/packages/src/nuxeo_5.9.6-00+20140826+01_source.changes
  • target/packages/src/nuxeo_5.9.6.orig.tar.gz

  • _______________________________________________
    ECM-QA mailing list
    ECM-QA@...
    http://lists.nuxeo.com/mailman/listinfo/ecm-qa
    
    Jenkins QA | 26 Aug 04:26 2014

    [QA] deploy-nuxeo-master - Build # 673 - Successful!

    BUILD SUCCESS
    Build URL https://qa.nuxeo.org/jenkins/job/deploy-nuxeo-master/673/
    Project: deploy-nuxeo-master
    Date of build: Tue, 26 Aug 2014 04:08:11 +0200
    Build duration: 18 min

    CHANGES
      Revision 7036b0d3bb0f6f5ab9234d9456657573975b8bce by jenkins:(NXP-15030: Upgrade to nuxeo-connect-client 1.4.17 (commit: 7036b0d3bb0f6f5ab9234d9456657573975b8bce))
      edit pom.xml

    _______________________________________________
    ECM-QA mailing list
    ECM-QA@...
    http://lists.nuxeo.com/mailman/listinfo/ecm-qa
    
    Jenkins QA | 26 Aug 01:02 2014

    [QA] FT-nuxeo-master-cmis-dm-tomcat-multiosdb - Build # 104 - Unstable!

    BUILD UNSTABLE
    Build URL https://qa.nuxeo.org/jenkins/job/FT-nuxeo-master-cmis-dm-tomcat-multiosdb/104/
    Project: FT-nuxeo-master-cmis-dm-tomcat-multiosdb
    Date of build: Mon, 25 Aug 2014 22:55:56 +0200
    Build duration: 2 hr 6 min and counting

    CHANGES
    No Changes

    _______________________________________________
    ECM-QA mailing list
    ECM-QA@...
    http://lists.nuxeo.com/mailman/listinfo/ecm-qa
    
    Jenkins QA | 25 Aug 14:19 2014

    [QA] nuxeo-master-versions - Build # 397 - Successful!

    BUILD SUCCESS
    Build URL https://qa.nuxeo.org/jenkins/job/nuxeo-master-versions/397/
    Project: nuxeo-master-versions
    Date of build: Mon, 25 Aug 2014 13:56:25 +0200
    Build duration: 22 min

    CHANGES
      Revision 7036b0d3bb0f6f5ab9234d9456657573975b8bce by jenkins:(NXP-15030: Upgrade to nuxeo-connect-client 1.4.17 (commit: 7036b0d3bb0f6f5ab9234d9456657573975b8bce))
      edit pom.xml

    _______________________________________________
    ECM-QA mailing list
    ECM-QA@...
    http://lists.nuxeo.com/mailman/listinfo/ecm-qa
    
    Jenkins QA | 25 Aug 13:23 2014

    Jenkins build is back to stable : FT-nuxeo-master-webdriver-dam-tomcat_permanentCheck #4405

    See <https://qa.nuxeo.org/jenkins/job/FT-nuxeo-master-webdriver-dam-tomcat_permanentCheck/4405/>
    

    Gmane